{"text_format":"1","workbook":"xlsx","n_sheets":3,"sheets":["User Guide","Simulator","Raw data"],"not_rendered":{"charts":0,"images":5,"macros":0,"external_links":1,"defined_names":3,"comments":0,"pivot_tables":0},"unopened":[],"bounds":{"document_bytes":16777216,"sheet_cells":100000,"rows_first":2000,"rows_last":500,"rows_between":2000,"halvings":0,"cell_chars":16384,"cell_head_chars":4096},"cells_cut":0,"cells_raw":0,"read":"whole","date_system":"1900"}

{"sheet":"User Guide","index":0,"n_rows":0,"n_cols":0,"rows_kept":0,"cut":false,"hidden":false,"merged":[]}

{"sheet":"Simulator","index":1,"n_rows":70,"n_cols":17,"rows_kept":70,"cut":false,"hidden":false,"merged":[[5,6,5,7],[7,6,7,7],[0,1,2,9]]}
[null,"Bridgelux SMD Products Simulator"]
[null,null,null,null,null,null,null,null,null,null,null,null,null,"Rev 6"]
[null,null,null,null,null,null,null,null,null,null,null,"Valid Until",null,"2019-06-30"]
[null,"Enter color and temperature values:",null,null,null,null,null,null,null,null,null,null,"Section 1"]
[]
[null,null,null,null,null,"Color Temperature and CRI:","2700K, 80 CRI"]
[]
[null,null,null,null,null,"Case Temperature (0-105℃):",25]
[]
[]
[]
[]
[null,"Lumen Output at Required Drive Current",null,null,null,null,null,null,null,null,null,null,"Section 2"]
[null,"Calculate lumens for selected drive current",null,null,null,null,null,null,null,null,"ENTER DRIVE CURRENT in mA (1-960mA):",null,120]
[null,"SMD 2835, 3030, 5050"]
[null,"Product","Part Number","Drive\nCurrent\n(mA)","Voltage\n(V)","Power\n(W)",{"$f":"\"Lumen DC @ Case = \"&G8&\" °C\"","v":"Lumen DC @ Case = 25 °C"},{"$f":"\"Efficacy DC @ Case = \"&G8&\" °C\"","v":"Efficacy DC @ Case = 25 °C"},"Max Drive\nCurrent\n(mA)","Typical\n Current\n (mA)","Typical Pulsed Lumens @ Case=25°C","Typical Pulsed Efficacy @ Case=25°C","Tj\n (°C)"]
[null,"2835 0.2W 3V",{"$f":"IFERROR(VLOOKUP($G$6,'Raw data'!$A$2:$N$28,2,0),\"\")","v":"BXEN-27E-11L-3AA-00-0-0"},{"$f":"IF(C17=\"-\",\"-\",IF($M$14>I17,\"-\",$M$14))","v":"-"},{"$f":"IF(D17=\"-\",\"-\",'Raw data'!D143+'Raw data'!F143)","v":"-"},{"$f":"IF(D17=\"-\",\"-\",D17*E17/1000)","v":"-"},{"$f":"IF(D17=\"-\",\"-\",Simulator!K17*'Raw data'!E143*'Raw data'!G143)","v":"-"},{"$f":"IF(D17=\"-\",\"-\",G17/F17)","v":"-"},{"$f":"IFERROR(VLOOKUP($G$6,'Raw data'!$A$30:$N$56,2,0),\"\")","v":100},{"$f":"IFERROR(VLOOKUP($G$6,'Raw data'!$A$58:$N$84,2,0),\"\")","v":60},{"$f":"IFERROR(VLOOKUP($G$6,'Raw data'!$A$86:$N$112,2,0),\"\")","v":26},{"$f":"IFERROR(VLOOKUP($G$6,'Raw data'!$A$114:$N$140,2,0),\"\")","v":144},{"$f":"IF(D17=\"-\",\"-\",'Raw data'!I143)","v":"-"}]
[null,"2835 0.2W 3V L",{"$f":"IFERROR(VLOOKUP($G$6,'Raw data'!$A$2:$P$28,16,0),\"\")","v":"BXEN-27E-11L-37A-00-0-0"},{"$f":"IF(C18=\"-\",\"-\",IF($M$14>I18,\"-\",$M$14))","v":"-"},{"$f":"IF(D18=\"-\",\"-\",'Raw data'!D156+'Raw data'!F156)","v":"-"},{"$f":"IF(D18=\"-\",\"-\",D18*E18/1000)","v":"-"},{"$f":"IF(D18=\"-\",\"-\",Simulator!K18*'Raw data'!E156*'Raw data'!G156)","v":"-"},{"$f":"IF(D18=\"-\",\"-\",G18/F18)","v":"-"},{"$f":"IFERROR(VLOOKUP($G$6,'Raw data'!$A$30:$P$56,16,0),\"\")","v":100},{"$f":"IFERROR(VLOOKUP($G$6,'Raw data'!$A$58:$P$84,16,0),\"\")","v":60},{"$f":"IFERROR(VLOOKUP($G$6,'Raw data'!$A$86:$P$112,16,0),\"\")","v":24},{"$f":"IFERROR(VLOOKUP($G$6,'Raw data'!$A$114:$P$140,16,0),\"\")","v":133},{"$f":"IF(D18=\"-\",\"-\",'Raw data'!I156)","v":"-"}]
[null,"2835 0.5W 3V",{"$f":"IFERROR(VLOOKUP($G$6,'Raw data'!$A$3:$N$28,4,0),\"\")","v":"BXEN-27E-11M-39A-00-0-0"},{"$f":"IF(C19=\"-\",\"-\",IF($M$14>I19,\"-\",$M$14))","v":120},{"$f":"IF(D19=\"-\",\"-\",'Raw data'!D144+'Raw data'!F144)","v":3.1210274268269549},{"$f":"IF(D19=\"-\",\"-\",D19*E19/1000)","v":0.37452329121923456},{"$f":"IF(D19=\"-\",\"-\",Simulator!K19*'Raw data'!E144*'Raw data'!G144)","v":49.401202158527802},{"$f":"IF(D19=\"-\",\"-\",G19/F19)","v":131.90421882095936},{"$f":"IFERROR(VLOOKUP($G$6,'Raw data'!$A$30:$N$56,4,0),\"\")","v":150},{"$f":"IFERROR(VLOOKUP($G$6,'Raw data'!$A$58:$N$84,4,0),\"\")","v":150},{"$f":"IFERROR(VLOOKUP($G$6,'Raw data'!$A$86:$N$112,4,0),\"\")","v":60},{"$f":"IFERROR(VLOOKUP($G$6,'Raw data'!$A$114:$N$140,4,0),\"\")","v":125},{"$f":"IF(D19=\"-\",\"-\",'Raw data'!I144)","v":29.502308073472001}]
[null,"2835 0.5W 3V Gen1",{"$f":"IFERROR(VLOOKUP($G$6,'Raw data'!$A$2:$S$28,19,0),\"\")","v":"BXEN-27E-11M-3A-00-0-0"},{"$f":"IF(C20=\"-\",\"-\",IF($M$14>I20,\"-\",$M$14))","v":120},{"$f":"IF(D20=\"-\",\"-\",'Raw data'!D159+'Raw data'!F159)","v":3.1770466276379361},{"$f":"IF(D20=\"-\",\"-\",D20*E20/1000)","v":0.38124559531655233},{"$f":"IF(D20=\"-\",\"-\",Simulator!K20*'Raw data'!E159*'Raw data'!G159)","v":50.468156479208673},{"$f":"IF(D20=\"-\",\"-\",G20/F20)","v":132.37702179169943},{"$f":"IFERROR(VLOOKUP($G$6,'Raw data'!$A$30:$S$56,19,0),\"\")","v":150},{"$f":"IFERROR(VLOOKUP($G$6,'Raw data'!$A$58:$S$84,19,0),\"\")","v":150},{"$f":"IFERROR(VLOOKUP($G$6,'Raw data'!$A$86:$S$112,19,0),\"\")","v":62},{"$f":"IFERROR(VLOOKUP($G$6,'Raw data'!$A$114:$S$140,19,0),\"\")","v":125},{"$f":"IF(D20=\"-\",\"-\",'Raw data'!I159)","v":32.647232865280003}]
[null,"2835 0.5W 3V Gen2",{"$f":"IFERROR(VLOOKUP($G$6,'Raw data'!$A$2:$T$28,20,0),\"\")","v":"BXEN-27E-11M-3AA-00-00-0"},{"$f":"IF(C21=\"-\",\"-\",IF($M$14>I21,\"-\",$M$14))","v":120},{"$f":"IF(D21=\"-\",\"-\",'Raw data'!D160+'Raw data'!F160)","v":3.0694123761555416},{"$f":"IF(D21=\"-\",\"-\",D21*E21/1000)","v":0.36832948513866498},{"$f":"IF(D21=\"-\",\"-\",Simulator!K21*'Raw data'!E160*'Raw data'!G160)","v":51.534266001932615},{"$f":"IF(D21=\"-\",\"-\",G21/F21)","v":139.91349615285759},{"$f":"IFERROR(VLOOKUP($G$6,'Raw data'!$A$30:$T$56,20,0),\"\")","v":150},{"$f":"IFERROR(VLOOKUP($G$6,'Raw data'!$A$58:$T$84,20,0),\"\")","v":150},{"$f":"IFERROR(VLOOKUP($G$6,'Raw data'!$A$86:$T$112,20,0),\"\")","v":63},{"$f":"IFERROR(VLOOKUP($G$6,'Raw data'!$A$114:$T$140,20,0),\"\")","v":131},{"$f":"IF(D21=\"-\",\"-\",'Raw data'!I160)","v":29.428269088768001}]
[null,"2835 0.5W 3V Gen3",{"$f":"IFERROR(VLOOKUP($G$6,'Raw data'!$A$2:$U$28,3,0),\"\")","v":"BXEN-27E-11M-3CA-00-0-0"},{"$f":"IF(C22=\"-\",\"-\",IF($M$14>I22,\"-\",$M$14))","v":120},{"$f":"IF(D22=\"-\",\"-\",'Raw data'!D162+'Raw data'!F162)","v":2.9981713304990136},{"$f":"IF(D22=\"-\",\"-\",D22*E22/1000)","v":0.35978055965988165},{"$f":"IF(D22=\"-\",\"-\",Simulator!K22*'Raw data'!E162*'Raw data'!G162)","v":56.54839897908856},{"$f":"IF(D22=\"-\",\"-\",G22/F22)","v":157.17469290877349},{"$f":"IFERROR(VLOOKUP($G$6,'Raw data'!$A$30:$T$56,3,0),\"\")","v":150},{"$f":"IFERROR(VLOOKUP($G$6,'Raw data'!$A$58:$T$84,3,0),\"\")","v":150},{"$f":"IFERROR(VLOOKUP($G$6,'Raw data'!$A$86:$T$112,3,0),\"\")","v":70},{"$f":"IFERROR(VLOOKUP($G$6,'Raw data'!$A$114:$T$140,3,0),\"\")","v":156},{"$f":"IF(D22=\"-\",\"-\",'Raw data'!I162)","v":33.662017005568003}]
[null,"2835 0.6W 6V ",{"$f":"IFERROR(VLOOKUP($G$6,'Raw data'!$A$2:$U$28,21,0),\"\")","v":"BXEN-27E-12M-6A-00-0-0"},{"$f":"IF(C23=\"-\",\"-\",IF($M$14>I23,\"-\",$M$14))","v":120},{"$f":"IF(D23=\"-\",\"-\",'Raw data'!D161+'Raw data'!F161)","v":6.3418119544917442},{"$f":"IF(D23=\"-\",\"-\",D23*E23/1000)","v":0.76101743453900927},{"$f":"IF(D23=\"-\",\"-\",Simulator!K23*'Raw data'!E161*'Raw data'!G161)","v":84.453633727444625},{"$f":"IF(D23=\"-\",\"-\",G23/F23)","v":110.97463723495757},{"$f":"IFERROR(VLOOKUP($G$6,'Raw data'!$A$30:$U$56,21,0),\"\")","v":120},{"$f":"IFERROR(VLOOKUP($G$6,'Raw data'!$A$58:$U$84,21,0),\"\")","v":100},{"$f":"IFERROR(VLOOKUP($G$6,'Raw data'!$A$86:$U$112,21,0),\"\")","v":75},{"$f":"IFERROR(VLOOKUP($G$6,'Raw data'!$A$114:$U$140,21,0),\"\")","v":117},{"$f":"IF(D23=\"-\",\"-\",'Raw data'!I161)","v":37.912105091737601}]
[null,"2835 1W 9V L",{"$f":"IFERROR(VLOOKUP($G$6,'Raw data'!$A$2:$Q$28,17,0),\"\")","v":"BXEN-27E-13H-98-00-0-0"},{"$f":"IF(C24=\"-\",\"-\",IF($M$14>I24,\"-\",$M$14))","v":120},{"$f":"IF(D24=\"-\",\"-\",'Raw data'!D157+'Raw data'!F157)","v":9.3850571150401993},{"$f":"IF(D24=\"-\",\"-\",D24*E24/1000)","v":1.1262068538048238},{"$f":"IF(D24=\"-\",\"-\",Simulator!K24*'Raw data'!E157*'Raw data'!G157)","v":128.39436037208716},{"$f":"IF(D24=\"-\",\"-\",G24/F24)","v":114.00601935453895},{"$f":"IFERROR(VLOOKUP($G$6,'Raw data'!$A$30:$Q$56,17,0),\"\")","v":120},{"$f":"IFERROR(VLOOKUP($G$6,'Raw data'!$A$58:$Q$84,17,0),\"\")","v":100},{"$f":"IFERROR(VLOOKUP($G$6,'Raw data'!$A$86:$Q$112,17,0),\"\")","v":115},{"$f":"IFERROR(VLOOKUP($G$6,'Raw data'!$A$114:$Q$140,17,0),\"\")","v":124},{"$f":"IF(D24=\"-\",\"-\",'Raw data'!I157)","v":40.841429574553601}]
[null,"2835 1W 9V Gen2",{"$f":"IFERROR(VLOOKUP($G$6,'Raw data'!$A$2:$N$28,5,0),\"\")","v":"BXEN-27E-13H-9B-00-0-0"},120,{"$f":"IF(D25=\"-\",\"-\",'Raw data'!D145+'Raw data'!F145)","v":9.7196728098188547},1.1663607371782625,{"$f":"IF(D25=\"-\",\"-\",Simulator!K25*'Raw data'!E145*'Raw data'!G145)","v":131.08852642713325},112.39106585863935,{"$f":"IFERROR(VLOOKUP($G$6,'Raw data'!$A$30:$N$56,5,0),\"\")","v":120},{"$f":"IFERROR(VLOOKUP($G$6,'Raw data'!$A$58:$N$84,5,0),\"\")","v":100},{"$f":"IFERROR(VLOOKUP($G$6,'Raw data'!$A$86:$N$112,5,0),\"\")","v":115},{"$f":"IFERROR(VLOOKUP($G$6,'Raw data'!$A$114:$N$140,5,0),\"\")","v":121},{"$f":"IF(D25=\"-\",\"-\",'Raw data'!I145)","v":36.711710348799997}]
[null,"2835 1W 9V Gen3",{"$f":"IFERROR(VLOOKUP($G$6,'Raw data'!$A$2:$R$28,18,0),\"\")","v":"BXEN-27E-13H-9C-00-0-0"},{"$f":"IF(C26=\"-\",\"-\",IF($M$14>I26,\"-\",$M$14))","v":120},{"$f":"IF(D26=\"-\",\"-\",'Raw data'!D158+'Raw data'!F158)","v":9.7013136094859984},{"$f":"IF(D26=\"-\",\"-\",D26*E26/1000)","v":1.1641576331383199},{"$f":"IF(D26=\"-\",\"-\",Simulator!K26*'Raw data'!E158*'Raw data'!G158)","v":141.48900839880326},{"$f":"IF(D26=\"-\",\"-\",G26/F26)","v":121.53767185065752},{"$f":"IFERROR(VLOOKUP($G$6,'Raw data'!$A$30:$R$56,18,0),\"\")","v":120},{"$f":"IFERROR(VLOOKUP($G$6,'Raw data'!$A$58:$R$84,18,0),\"\")","v":100},{"$f":"IFERROR(VLOOKUP($G$6,'Raw data'!$A$86:$R$112,18,0),\"\")","v":125},{"$f":"IFERROR(VLOOKUP($G$6,'Raw data'!$A$114:$R$140,18,0),\"\")","v":134},{"$f":"IF(D26=\"-\",\"-\",'Raw data'!I158)","v":35.047433669785597}]
[null,"2835 1W 9V CRI90(99N)",{"$f":"IFERROR(VLOOKUP($G$6,'Raw data'!$A$2:$V$28,22,0),\"\")","v":"-"},{"$f":"IF(C27=\"-\",\"-\",IF($M$14>I27,\"-\",$M$14))","v":"-"},{"$f":"IF(D27=\"-\",\"-\",'Raw data'!D163+'Raw data'!F163)","v":"-"},{"$f":"IF(D27=\"-\",\"-\",D27*E27/1000)","v":"-"},{"$f":"IF(D27=\"-\",\"-\",Simulator!K27*'Raw data'!E163*'Raw data'!G163)","v":"-"},{"$f":"IF(D27=\"-\",\"-\",G27/F27)","v":"-"},{"$f":"IFERROR(VLOOKUP($G$6,'Raw data'!$A$30:$V$56,22,0),\"\")","v":"-"},{"$f":"IFERROR(VLOOKUP($G$6,'Raw data'!$A$58:$V$84,22,0),\"\")","v":"-"},{"$f":"IFERROR(VLOOKUP($G$6,'Raw data'!$A$86:$V$112,22,0),\"\")","v":"-"},{"$f":"IFERROR(VLOOKUP($G$6,'Raw data'!$A$114:$V$140,22,0),\"\")","v":"-"},{"$f":"IF(D27=\"-\",\"-\",'Raw data'!I163)","v":"-"}]
[null,"2835 1W 9V CRI90(9BN)",{"$f":"IFERROR(VLOOKUP($G$6,'Raw data'!$A$2:$W$28,23,0),\"\")","v":"-"},{"$f":"IF(C28=\"-\",\"-\",IF($M$14>I28,\"-\",$M$14))","v":"-"},{"$f":"IF(D28=\"-\",\"-\",'Raw data'!D164+'Raw data'!F164)","v":"-"},{"$f":"IF(D28=\"-\",\"-\",D28*E28/1000)","v":"-"},{"$f":"IF(D28=\"-\",\"-\",Simulator!K28*'Raw data'!E164*'Raw data'!G164)","v":"-"},{"$f":"IF(D28=\"-\",\"-\",G28/F28)","v":"-"},{"$f":"IFERROR(VLOOKUP($G$6,'Raw data'!$A$30:$W$56,23,0),\"\")","v":"-"},{"$f":"IFERROR(VLOOKUP($G$6,'Raw data'!$A$58:$W$84,23,0),\"\")","v":"-"},{"$f":"IFERROR(VLOOKUP($G$6,'Raw data'!$A$86:$W$112,23,0),\"\")","v":"-"},{"$f":"IFERROR(VLOOKUP($G$6,'Raw data'!$A$114:$W$140,23,0),\"\")","v":"-"},{"$f":"IF(D28=\"-\",\"-\",'Raw data'!I164)","v":"-"}]
[null,"2835 1W 9V CRI90(9CN)",{"$f":"IFERROR(VLOOKUP($G$6,'Raw data'!$A$2:$X$28,24,0),\"\")","v":"-"},{"$f":"IF(C29=\"-\",\"-\",IF($M$14>I29,\"-\",$M$14))","v":"-"},{"$f":"IF(D29=\"-\",\"-\",'Raw data'!D165+'Raw data'!F165)","v":"-"},{"$f":"IF(D29=\"-\",\"-\",D29*E29/1000)","v":"-"},{"$f":"IF(D29=\"-\",\"-\",Simulator!K29*'Raw data'!E165*'Raw data'!G165)","v":"-"},{"$f":"IF(D29=\"-\",\"-\",G29/F29)","v":"-"},{"$f":"IFERROR(VLOOKUP($G$6,'Raw data'!$A$30:$X$56,24,0),\"\")","v":"-"},{"$f":"IFERROR(VLOOKUP($G$6,'Raw data'!$A$58:$X$84,24,0),\"\")","v":"-"},{"$f":"IFERROR(VLOOKUP($G$6,'Raw data'!$A$86:$X$112,24,0),\"\")","v":"-"},{"$f":"IFERROR(VLOOKUP($G$6,'Raw data'!$A$114:$X$140,24,0),\"\")","v":"-"},{"$f":"IF(D29=\"-\",\"-\",'Raw data'!I165)","v":"-"}]
[null,"2835 1W 12V Gen2",{"$f":"IFERROR(VLOOKUP($G$6,'Raw data'!$A$2:$N$28,6,0),\"\")","v":"BXEN-27E-14H-12B-00-0-0"},"-",{"$f":"IF(D30=\"-\",\"-\",'Raw data'!D146+'Raw data'!F146)","v":"-"},"-",{"$f":"IF(D30=\"-\",\"-\",Simulator!K30*'Raw data'!E146*'Raw data'!G146)","v":"-"},"-",{"$f":"IFERROR(VLOOKUP($G$6,'Raw data'!$A$30:$N$56,6,0),\"\")","v":90},{"$f":"IFERROR(VLOOKUP($G$6,'Raw data'!$A$58:$N$84,6,0),\"\")","v":75},{"$f":"IFERROR(VLOOKUP($G$6,'Raw data'!$A$86:$N$112,6,0),\"\")","v":118},{"$f":"IFERROR(VLOOKUP($G$6,'Raw data'!$A$114:$N$140,6,0),\"\")","v":129},{"$f":"IF(D30=\"-\",\"-\",'Raw data'!I146)","v":"-"}]
[null,"2835 1W 18V",{"$f":"IFERROR(VLOOKUP($G$6,'Raw data'!$A$2:$O$28,15,0),\"\")","v":"BXEN-27E-11H-18A-00-0-0"},{"$f":"IF(C31=\"-\",\"-\",IF($M$14>I31,\"-\",$M$14))","v":"-"},{"$f":"IF(D31=\"-\",\"-\",'Raw data'!D155+'Raw data'!F155)","v":"-"},{"$f":"IF(D31=\"-\",\"-\",D31*E31/1000)","v":"-"},{"$f":"IF(D31=\"-\",\"-\",Simulator!K31*'Raw data'!E155*'Raw data'!G155)","v":"-"},{"$f":"IF(D31=\"-\",\"-\",G31/F31)","v":"-"},{"$f":"IFERROR(VLOOKUP($G$6,'Raw data'!$A$30:$O$56,15,0),\"\")","v":60},{"$f":"IFERROR(VLOOKUP($G$6,'Raw data'!$A$58:$O$84,15,0),\"\")","v":50},{"$f":"IFERROR(VLOOKUP($G$6,'Raw data'!$A$86:$O$112,15,0),\"\")","v":120},{"$f":"IFERROR(VLOOKUP($G$6,'Raw data'!$A$114:$O$140,15,0),\"\")","v":133},{"$f":"IF(D31=\"-\",\"-\",'Raw data'!I155)","v":"-"}]
[null,"3030 1W 6V",{"$f":"IFERROR(VLOOKUP($G$6,'Raw data'!$A$2:$N$28,7,0),\"\")","v":"BXEM-27E0000-0-000"},120,{"$f":"IF(D32=\"-\",\"-\",'Raw data'!D147+'Raw data'!F147)","v":6.0886756923756833},0.73064108308508191,{"$f":"IF(D32=\"-\",\"-\",Simulator!K32*'Raw data'!E147*'Raw data'!G147)","v":100.60788317194327},137.69809212908393,{"$f":"IFERROR(VLOOKUP($G$6,'Raw data'!$A$30:$N$56,7,0),\"\")","v":240},{"$f":"IFERROR(VLOOKUP($G$6,'Raw data'!$A$58:$N$84,7,0),\"\")","v":150},{"$f":"IFERROR(VLOOKUP($G$6,'Raw data'!$A$86:$N$112,7,0),\"\")","v":125},{"$f":"IFERROR(VLOOKUP($G$6,'Raw data'!$A$114:$N$140,7,0),\"\")","v":133},{"$f":"IF(D32=\"-\",\"-\",'Raw data'!I147)","v":33.801389624320002}]
[null,"3030 1W 6V(S)",{"$f":"IFERROR(VLOOKUP($G$6,'Raw data'!$A$2:$Y$28,25,0),\"\")","v":"BXEM-27E12H-6A-00-0-0"},120,{"$f":"IF(D33=\"-\",\"-\",'Raw data'!D166+'Raw data'!F166)","v":5.8498284707584833},0.70197941649101803,{"$f":"IF(D33=\"-\",\"-\",Simulator!K33*'Raw data'!E166*'Raw data'!G166)","v":107.44743603290635},{"$f":"IF(D33=\"-\",\"-\",G33/F33)","v":153.06351369959458},{"$f":"IFERROR(VLOOKUP($G$6,'Raw data'!$A$30:$Y$56,25,0),\"\")","v":240},{"$f":"IFERROR(VLOOKUP($G$6,'Raw data'!$A$58:$Y$84,25,0),\"\")","v":150},{"$f":"IFERROR(VLOOKUP($G$6,'Raw data'!$A$86:$Y$112,25,0),\"\")","v":133},{"$f":"IFERROR(VLOOKUP($G$6,'Raw data'!$A$114:$Y$140,25,0),\"\")","v":146},{"$f":"IF(D33=\"-\",\"-\",'Raw data'!I166)","v":33.445598507008}]
[null,"5050 1W 24V",{"$f":"IFERROR(VLOOKUP($G$6,'Raw data'!$A$2:$N$28,8,0),\"\")","v":"BXEP-27E-181-24A-00-00-0 "},120,{"$f":"IF(D34=\"-\",\"-\",'Raw data'!D148+'Raw data'!F148)","v":23.458549449866176},2.8150259339839412,{"$f":"IF(D34=\"-\",\"-\",Simulator!K34*'Raw data'!E148*'Raw data'!G148)","v":404.8726999101159},143.82556658621021,{"$f":"IFERROR(VLOOKUP($G$6,'Raw data'!$A$30:$N$56,8,0),\"\")","v":240},{"$f":"IFERROR(VLOOKUP($G$6,'Raw data'!$A$58:$N$84,8,0),\"\")","v":45},{"$f":"IFERROR(VLOOKUP($G$6,'Raw data'!$A$86:$N$112,8,0),\"\")","v":163},{"$f":"IFERROR(VLOOKUP($G$6,'Raw data'!$A$114:$N$140,8,0),\"\")","v":165},{"$f":"IF(D34=\"-\",\"-\",'Raw data'!I148)","v":33.7847825903104}]
[null,"5050 3W 9V",{"$f":"IFERROR(VLOOKUP($G$6,'Raw data'!$A$2:$N$28,9,0),\"\")","v":"BXEP-27E-233-09A-00-00-0"},120,{"$f":"IF(D35=\"-\",\"-\",'Raw data'!D149+'Raw data'!F149)","v":8.4652273597433947},1.0158272831692075,{"$f":"IF(D35=\"-\",\"-\",Simulator!K35*'Raw data'!E149*'Raw data'!G149)","v":158.01441232487204},155.55243981230166,{"$f":"IFERROR(VLOOKUP($G$6,'Raw data'!$A$30:$N$56,9,0),\"\")","v":480},{"$f":"IFERROR(VLOOKUP($G$6,'Raw data'!$A$58:$N$84,9,0),\"\")","v":320},{"$f":"IFERROR(VLOOKUP($G$6,'Raw data'!$A$86:$N$112,9,0),\"\")","v":389},{"$f":"IFERROR(VLOOKUP($G$6,'Raw data'!$A$114:$N$140,9,0),\"\")","v":131},{"$f":"IF(D35=\"-\",\"-\",'Raw data'!I149)","v":28.359339974932482}]
[null,"5050 3W 18V",{"$f":"IFERROR(VLOOKUP($G$6,'Raw data'!$A$2:$N$28,10,0),\"\")","v":"BXEP-27E-163-18A-00-00-0"},120,{"$f":"IF(D36=\"-\",\"-\",'Raw data'!D150+'Raw data'!F150)","v":17.832494519301026},2.1398993423161232,{"$f":"IF(D36=\"-\",\"-\",Simulator!K36*'Raw data'!E150*'Raw data'!G150)","v":298.22685027537619},139.36489645937735,{"$f":"IFERROR(VLOOKUP($G$6,'Raw data'!$A$30:$N$56,10,0),\"\")","v":240},{"$f":"IFERROR(VLOOKUP($G$6,'Raw data'!$A$58:$N$84,10,0),\"\")","v":160},{"$f":"IFERROR(VLOOKUP($G$6,'Raw data'!$A$86:$N$112,10,0),\"\")","v":389},{"$f":"IFERROR(VLOOKUP($G$6,'Raw data'!$A$114:$N$140,10,0),\"\")","v":131},{"$f":"IF(D36=\"-\",\"-\",'Raw data'!I150)","v":32.119293220864002}]
[null,"5050 5W 9V",{"$f":"IFERROR(VLOOKUP($G$6,'Raw data'!$A$2:$N$28,11,0),\"\")","v":"BXEP-27E-435-09A-00-00-0"},120,{"$f":"IF(D37=\"-\",\"-\",'Raw data'!D151+'Raw data'!F151)","v":8.2085187169159646},0.98502224602991573,{"$f":"IF(D37=\"-\",\"-\",Simulator!K37*'Raw data'!E151*'Raw data'!G151)","v":153.99407004026011},156.3356265921158,{"$f":"IFERROR(VLOOKUP($G$6,'Raw data'!$A$30:$N$56,11,0),\"\")","v":800},{"$f":"IFERROR(VLOOKUP($G$6,'Raw data'!$A$58:$N$84,11,0),\"\")","v":500},{"$f":"IFERROR(VLOOKUP($G$6,'Raw data'!$A$86:$N$112,11,0),\"\")","v":579},{"$f":"IFERROR(VLOOKUP($G$6,'Raw data'!$A$114:$N$140,11,0),\"\")","v":125},{"$f":"IF(D37=\"-\",\"-\",'Raw data'!I151)","v":26.873504834317313}]
[null,"5050 5W 36V",{"$f":"IFERROR(VLOOKUP($G$6,'Raw data'!$A$2:$N$28,12,0),\"\")","v":"BXEP-27E-1C5-36A-00-00-0"},120,{"$f":"IF(D38=\"-\",\"-\",'Raw data'!D152+'Raw data'!F152)","v":36.803269116298935},4.4163922939558722,{"$f":"IF(D38=\"-\",\"-\",Simulator!K38*'Raw data'!E152*'Raw data'!G152)","v":550.49846069954845},124.64890436769903,{"$f":"IFERROR(VLOOKUP($G$6,'Raw data'!$A$30:$N$56,12,0),\"\")","v":200},{"$f":"IFERROR(VLOOKUP($G$6,'Raw data'!$A$58:$N$84,12,0),\"\")","v":125},{"$f":"IFERROR(VLOOKUP($G$6,'Raw data'!$A$86:$N$112,12,0),\"\")","v":579},{"$f":"IFERROR(VLOOKUP($G$6,'Raw data'!$A$114:$N$140,12,0),\"\")","v":125},{"$f":"IF(D38=\"-\",\"-\",'Raw data'!I152)","v":33.430870561791998}]
[null,"5050 5W 9V Gen2",{"$f":"IFERROR(VLOOKUP($G$6,'Raw data'!$A$2:$N$28,13,0),\"\")","v":"BXEP-27E-435-09B-00-00-0"},120,{"$f":"IF(D39=\"-\",\"-\",'Raw data'!D153+'Raw data'!F153)","v":8.0762718201297901},0.96915261841557476,{"$f":"IF(D39=\"-\",\"-\",Simulator!K39*'Raw data'!E153*'Raw data'!G153)","v":156.66978076636676},161.65645925045254,{"$f":"IFERROR(VLOOKUP($G$6,'Raw data'!$A$30:$N$56,13,0),\"\")","v":960},{"$f":"IFERROR(VLOOKUP($G$6,'Raw data'!$A$58:$N$84,13,0),\"\")","v":500},{"$f":"IFERROR(VLOOKUP($G$6,'Raw data'!$A$86:$N$112,13,0),\"\")","v":615},{"$f":"IFERROR(VLOOKUP($G$6,'Raw data'!$A$114:$N$140,13,0),\"\")","v":139},{"$f":"IF(D39=\"-\",\"-\",'Raw data'!I153)","v":26.84343655946752}]
[null,"5050 5W 36V Gen2",{"$f":"IFERROR(VLOOKUP($G$6,'Raw data'!$A$2:$N$28,14,0),\"\")","v":"BXEP-27E-1C5-36B-00-00-0"},120,{"$f":"IF(D40=\"-\",\"-\",'Raw data'!D154+'Raw data'!F154)","v":35.166007968054714},4.2199209561665656,{"$f":"IF(D40=\"-\",\"-\",Simulator!K40*'Raw data'!E154*'Raw data'!G154)","v":228.60697448957393},54.173283543501171,{"$f":"IFERROR(VLOOKUP($G$6,'Raw data'!$A$30:$N$56,14,0),\"\")","v":240},{"$f":"IFERROR(VLOOKUP($G$6,'Raw data'!$A$58:$N$84,14,0),\"\")","v":125},{"$f":"IFERROR(VLOOKUP($G$6,'Raw data'!$A$8:$N$112,14,0),\"\")","v":240},{"$f":"IFERROR(VLOOKUP($G$6,'Raw data'!$A$114:$N$140,14,0),\"\")","v":139},{"$f":"IF(D40=\"-\",\"-\",'Raw data'!I154)","v":33.056928484095998}]
[]
[]
[null,"Drive Current Needed for Required Lumens",null,null,null,null,null,null,null,null,null,null,"Section 3"]
[null,"Calculate drive current required for chosen lumen output",null,null,null,null,null,null,null,null,"ENTER REQUIRED LUMENS(>0lm):",null,107]
[null,"SMD 3030, 2835, 5050"]
[null,"Product","Part Number","Drive\nCurrent\n(mA)","Voltage\n(V)","Power\n(W)",{"$f":"\"Lumen DC @ Case = \"&G8&\" °C\"","v":"Lumen DC @ Case = 25 °C"},{"$f":"\"Efficacy DC @ Case = \"&G8&\" °C\"","v":"Efficacy DC @ Case = 25 °C"},"Max Drive\nCurrent\n(mA)","Typical\n Current\n (mA)","Typical Pulsed Lumens @ Case=25°C","Typical Pulsed Efficacy @ Case=25°C","Tj\n (°C)"]
[null,"2835 0.2W 3V",{"$f":"IFERROR(VLOOKUP($G$6,'Raw data'!$A$2:$N$28,2,0),\"\")","v":"BXEN-27E-11L-3AA-00-0-0"},{"$f":"IF(C47=\"-\",\"-\",IF(Q47>I47,\"-\",'Raw data'!H143))","v":"-"},{"$f":"IF(D47=\"-\",\"-\",'Raw data'!P143+'Raw data'!S143)","v":"-"},{"$f":"IF(D47=\"-\",\"-\",D47*E47/1000)","v":"-"},{"$f":"IF(C47=\"-\",\"-\",IF(D47=\"-\",\"-\",$M$44))","v":"-"},{"$f":"IF(D47=\"-\",\"-\",G47/F47)","v":"-"},{"$f":"IFERROR(VLOOKUP($G$6,'Raw data'!$A$30:$N$56,2,0),\"\")","v":100},{"$f":"IFERROR(VLOOKUP($G$6,'Raw data'!$A$58:$N$84,2,0),\"\")","v":60},{"$f":"IFERROR(VLOOKUP($G$6,'Raw data'!$A$86:$N$112,2,0),\"\")","v":26},{"$f":"IFERROR(VLOOKUP($G$6,'Raw data'!$A$114:$N$140,2,0),\"\")","v":144},{"$f":"IF(C47=\"-\",\"-\",IF(D47=\"-\",\"-\",'Raw data'!N143))","v":"-"},null,null,null,{"$f":"'Raw data'!H143","v":450.41582158225867}]
[null,"2835 0.2W 3V L",{"$f":"IFERROR(VLOOKUP($G$6,'Raw data'!$A$2:$P$28,16,0),\"\")","v":"BXEN-27E-11L-37A-00-0-0"},{"$f":"IF(C48=\"-\",\"-\",IF(Q48>I48,\"-\",'Raw data'!H156))","v":"-"},{"$f":"IF(D48=\"-\",\"-\",'Raw data'!P156+'Raw data'!S156)","v":"-"},{"$f":"IF(D48=\"-\",\"-\",D48*E48/1000)","v":"-"},{"$f":"IF(C48=\"-\",\"-\",IF(D48=\"-\",\"-\",$M$44))","v":"-"},{"$f":"IF(D48=\"-\",\"-\",G48/F48)","v":"-"},{"$f":"IFERROR(VLOOKUP($G$6,'Raw data'!$A$30:$P$56,16,0),\"\")","v":100},{"$f":"IFERROR(VLOOKUP($G$6,'Raw data'!$A$58:$O$84,15,0),\"\")","v":50},{"$f":"IFERROR(VLOOKUP($G$6,'Raw data'!$A$86:$P$112,16,0),\"\")","v":24},{"$f":"IFERROR(VLOOKUP($G$6,'Raw data'!$A$114:$O$140,15,0),\"\")","v":133},{"$f":"IF(C48=\"-\",\"-\",IF(D48=\"-\",\"-\",'Raw data'!N156))","v":"-"},null,null,null,{"$f":"'Raw data'!H156","v":"-"}]
[null,"2835 0.5W 3V",{"$f":"IFERROR(VLOOKUP($G$6,'Raw data'!$A$2:$N$28,4,0),\"\")","v":"BXEN-27E-11M-39A-00-0-0"},{"$f":"IF(C49=\"-\",\"-\",IF(Q49>I49,\"-\",'Raw data'!H144))","v":"-"},{"$f":"IF(D49=\"-\",\"-\",'Raw data'!P144+'Raw data'!S144)","v":"-"},{"$f":"IF(D49=\"-\",\"-\",D49*E49/1000)","v":"-"},{"$f":"IF(C49=\"-\",\"-\",IF(D49=\"-\",\"-\",$M$44))","v":"-"},{"$f":"IF(D49=\"-\",\"-\",G49/F49)","v":"-"},{"$f":"IFERROR(VLOOKUP($G$6,'Raw data'!$A$30:$N$56,4,0),\"\")","v":150},{"$f":"IFERROR(VLOOKUP($G$6,'Raw data'!$A$58:$N$84,4,0),\"\")","v":150},{"$f":"IFERROR(VLOOKUP($G$6,'Raw data'!$A$86:$N$112,4,0),\"\")","v":60},{"$f":"IFERROR(VLOOKUP($G$6,'Raw data'!$A$114:$N$140,4,0),\"\")","v":125},{"$f":"IF(C49=\"-\",\"-\",IF(D49=\"-\",\"-\",'Raw data'!N144))","v":"-"},null,null,null,{"$f":"'Raw data'!H144","v":340.13689427510963}]
[null,"2835 0.5W 3V Gen1",{"$f":"IFERROR(VLOOKUP($G$6,'Raw data'!$A$2:$S$28,19,0),\"\")","v":"BXEN-27E-11M-3A-00-0-0"},{"$f":"IF(C50=\"-\",\"-\",IF(Q50>I50,\"-\",'Raw data'!H159))","v":"-"},{"$f":"IF(D50=\"-\",\"-\",'Raw data'!P159+'Raw data'!S159)","v":"-"},{"$f":"IF(D50=\"-\",\"-\",D50*E50/1000)","v":"-"},{"$f":"IF(C50=\"-\",\"-\",IF(D50=\"-\",\"-\",$M$44))","v":"-"},{"$f":"IF(D50=\"-\",\"-\",G50/F50)","v":"-"},{"$f":"IFERROR(VLOOKUP($G$6,'Raw data'!$A$30:$S$56,19,0),\"\")","v":150},{"$f":"IFERROR(VLOOKUP($G$6,'Raw data'!$A$58:$S$84,19,0),\"\")","v":150},{"$f":"IFERROR(VLOOKUP($G$6,'Raw data'!$A$86:$S$112,19,0),\"\")","v":62},{"$f":"IFERROR(VLOOKUP($G$6,'Raw data'!$A$114:$S$140,19,0),\"\")","v":125},{"$f":"IF(C50=\"-\",\"-\",IF(D50=\"-\",\"-\",'Raw data'!N159))","v":"-"},null,null,null,{"$f":"'Raw data'!H159","v":330.82073974643362}]
[null,"2835 0.5W 3V Gen 2",{"$f":"IFERROR(VLOOKUP($G$6,'Raw data'!$A$2:$T$28,20,0),\"\")","v":"BXEN-27E-11M-3AA-00-00-0"},{"$f":"IF(C51=\"-\",\"-\",IF(Q51>I51,\"-\",'Raw data'!H160))","v":"-"},{"$f":"IF(D51=\"-\",\"-\",'Raw data'!P160+'Raw data'!S160)","v":"-"},{"$f":"IF(D51=\"-\",\"-\",D51*E51/1000)","v":"-"},{"$f":"IF(C51=\"-\",\"-\",IF(D51=\"-\",\"-\",$M$44))","v":"-"},{"$f":"IF(D51=\"-\",\"-\",G51/F51)","v":"-"},{"$f":"IFERROR(VLOOKUP($G$6,'Raw data'!$A$30:$T$56,20,0),\"\")","v":150},{"$f":"IFERROR(VLOOKUP($G$6,'Raw data'!$A$58:$T$84,20,0),\"\")","v":150},{"$f":"IFERROR(VLOOKUP($G$6,'Raw data'!$A$86:$T$112,20,0),\"\")","v":63},{"$f":"IFERROR(VLOOKUP($G$6,'Raw data'!$A$114:$T$140,20,0),\"\")","v":131},{"$f":"IF(C51=\"-\",\"-\",IF(D51=\"-\",\"-\",'Raw data'!N160))","v":"-"},null,null,null,{"$f":"'Raw data'!H160","v":316.68126097063282}]
[null,"2835 0.5W 3V Gen3",{"$f":"IFERROR(VLOOKUP($G$6,'Raw data'!$A$2:$T$28,3,0),\"\")","v":"BXEN-27E-11M-3CA-00-0-0"},{"$f":"IF(C52=\"-\",\"-\",IF(Q52>I52,\"-\",'Raw data'!H162))","v":254.91066079559437},{"$f":"IF(D52=\"-\",\"-\",'Raw data'!P162+'Raw data'!S162)","v":3.2735169132420974},{"$f":"IF(D52=\"-\",\"-\",D52*E52/1000)","v":0.83445435948009739},{"$f":"IF(C52=\"-\",\"-\",IF(D52=\"-\",\"-\",$M$44))","v":107},{"$f":"IF(D52=\"-\",\"-\",G52/F52)","v":128.22750433788352},{"$f":"IFERROR(VLOOKUP($G$6,'Raw data'!$A$30:$T$56,3,0),\"\")","v":150},{"$f":"IFERROR(VLOOKUP($G$6,'Raw data'!$A$58:$T$84,3,0),\"\")","v":150},{"$f":"IFERROR(VLOOKUP($G$6,'Raw data'!$A$86:$T$112,3,0),\"\")","v":70},{"$f":"IFERROR(VLOOKUP($G$6,'Raw data'!$A$114:$T$140,3,0),\"\")","v":156},{"$f":"IF(C52=\"-\",\"-\",IF(D52=\"-\",\"-\",'Raw data'!N162))","v":44.36697921677797}]
[null,"2835 0.6W 6V ",{"$f":"IFERROR(VLOOKUP($G$6,'Raw data'!$A$2:$U$28,21,0),\"\")","v":"BXEN-27E-12M-6A-00-0-0"},{"$f":"IF(C53=\"-\",\"-\",IF(Q53>I53,\"-\",'Raw data'!H161))","v":"-"},{"$f":"IF(D53=\"-\",\"-\",'Raw data'!P161+'Raw data'!S161)","v":"-"},{"$f":"IF(D53=\"-\",\"-\",D53*E53/1000)","v":"-"},{"$f":"IF(C53=\"-\",\"-\",IF(D53=\"-\",\"-\",$M$44))","v":"-"},{"$f":"IF(D53=\"-\",\"-\",G53/F53)","v":"-"},{"$f":"IFERROR(VLOOKUP($G$6,'Raw data'!$A$30:$U$56,21,0),\"\")","v":120},{"$f":"IFERROR(VLOOKUP($G$6,'Raw data'!$A$58:$U$84,21,0),\"\")","v":100},{"$f":"IFERROR(VLOOKUP($G$6,'Raw data'!$A$86:$U$112,21,0),\"\")","v":75},{"$f":"IFERROR(VLOOKUP($G$6,'Raw data'!$A$114:$U$140,21,0),\"\")","v":117},{"$f":"IF(C53=\"-\",\"-\",IF(D53=\"-\",\"-\",'Raw data'!N161))","v":"-"},null,null,null,{"$f":"'Raw data'!H161","v":168.76192693859332}]
[null,"2835 1W 9V L",{"$f":"IFERROR(VLOOKUP($G$6,'Raw data'!$A$2:$Q$28,17,0),\"\")","v":"BXEN-27E-13H-98-00-0-0"},{"$f":"IF(C54=\"-\",\"-\",IF(Q54>I54,\"-\",'Raw data'!H157))","v":94.193228650330582},{"$f":"IF(D54=\"-\",\"-\",'Raw data'!P157+'Raw data'!S157)","v":9.1535097918847708},{"$f":"IF(D54=\"-\",\"-\",D54*E54/1000)","v":0.86219864078004205},{"$f":"IF(C54=\"-\",\"-\",IF(D54=\"-\",\"-\",$M$44))","v":107},{"$f":"IF(D54=\"-\",\"-\",G54/F54)","v":124.10133226746419},{"$f":"IFERROR(VLOOKUP($G$6,'Raw data'!$A$30:$Q$56,17,0),\"\")","v":120},{"$f":"IFERROR(VLOOKUP($G$6,'Raw data'!$A$58:$Q$84,17,0),\"\")","v":100},{"$f":"IFERROR(VLOOKUP($G$6,'Raw data'!$A$86:$Q$112,17,0),\"\")","v":115},{"$f":"IFERROR(VLOOKUP($G$6,'Raw data'!$A$114:$Q$140,17,0),\"\")","v":124},{"$f":"IF(C54=\"-\",\"-\",IF(D54=\"-\",\"-\",'Raw data'!N157))","v":36.735442925659882},null,null,null,{"$f":"'Raw data'!H157","v":94.193228650330582}]
[null,"2835 1W 9V Gen2",{"$f":"IFERROR(VLOOKUP($G$6,'Raw data'!$A$2:$N$28,5,0),\"\")","v":"BXEN-27E-13H-9B-00-0-0"},{"$f":"IF(C55=\"-\",\"-\",IF(Q55>I55,\"-\",'Raw data'!H145))","v":93.674773562656},{"$f":"IF(D55=\"-\",\"-\",'Raw data'!P145+'Raw data'!S145)","v":9.3868902531509555},0.8793148189214185,107,121.6856553506603,{"$f":"IFERROR(VLOOKUP($G$6,'Raw data'!$A$30:$N$56,5,0),\"\")","v":120},{"$f":"IFERROR(VLOOKUP($G$6,'Raw data'!$A$58:$N$84,5,0),\"\")","v":100},{"$f":"IFERROR(VLOOKUP($G$6,'Raw data'!$A$86:$N$112,5,0),\"\")","v":115},{"$f":"IFERROR(VLOOKUP($G$6,'Raw data'!$A$114:$N$140,5,0),\"\")","v":121},{"$f":"IF(C55=\"-\",\"-\",IF(D55=\"-\",\"-\",'Raw data'!N145))","v":33.634363388386674},null,null,null,{"$f":"'Raw data'!H145","v":93.674773562656}]
[null,"2835 1W 9V Gen3",{"$f":"IFERROR(VLOOKUP($G$6,'Raw data'!$A$2:$R$28,18,0),\"\")","v":"BXEN-27E-13H-9C-00-0-0"},{"$f":"IF(C56=\"-\",\"-\",IF(Q56>I56,\"-\",'Raw data'!H158))","v":84.394917249449705},{"$f":"IF(D56=\"-\",\"-\",'Raw data'!P158+'Raw data'!S158)","v":9.2640596945175506},{"$f":"IF(D56=\"-\",\"-\",D56*E56/1000)","v":0.78183955131277105},{"$f":"IF(C56=\"-\",\"-\",IF(D56=\"-\",\"-\",$M$44))","v":107},{"$f":"IF(D56=\"-\",\"-\",G56/F56)","v":136.85672440123867},{"$f":"IFERROR(VLOOKUP($G$6,'Raw data'!$A$30:$R$56,18,0),\"\")","v":120},{"$f":"IFERROR(VLOOKUP($G$6,'Raw data'!$A$58:$R$84,18,0),\"\")","v":100},{"$f":"IFERROR(VLOOKUP($G$6,'Raw data'!$A$86:$R$112,18,0),\"\")","v":125},{"$f":"IFERROR(VLOOKUP($G$6,'Raw data'!$A$114:$R$140,18,0),\"\")","v":134},{"$f":"IF(C56=\"-\",\"-\",IF(D56=\"-\",\"-\",'Raw data'!N158))","v":31.622715141574147},null,null,null,{"$f":"'Raw data'!H158","v":84.394917249449705}]
[null,"2835 1W 9V CRI90(99N)",{"$f":"IFERROR(VLOOKUP($G$6,'Raw data'!$A$2:$V$28,22,0),\"\")","v":"-"},{"$f":"IF(C57=\"-\",\"-\",IF(Q57>I57,\"-\",'Raw data'!H163))","v":"-"},{"$f":"IF(D57=\"-\",\"-\",'Raw data'!P163+'Raw data'!S163)","v":"-"},{"$f":"IF(D57=\"-\",\"-\",D57*E57/1000)","v":"-"},{"$f":"IF(C57=\"-\",\"-\",IF(D57=\"-\",\"-\",$M$44))","v":"-"},{"$f":"IF(D57=\"-\",\"-\",G57/F57)","v":"-"},{"$f":"IFERROR(VLOOKUP($G$6,'Raw data'!$A$30:$V$56,22,0),\"\")","v":"-"},{"$f":"IFERROR(VLOOKUP($G$6,'Raw data'!$A$58:$V$84,22,0),\"\")","v":"-"},{"$f":"IFERROR(VLOOKUP($G$6,'Raw data'!$A$86:$V$112,22,0),\"\")","v":"-"},{"$f":"IFERROR(VLOOKUP($G$6,'Raw data'!$A$114:$V$140,22,0),\"\")","v":"-"},{"$f":"IF(C57=\"-\",\"-\",IF(D57=\"-\",\"-\",'Raw data'!N163))","v":"-"}]
[null,"2835 1W 9V CRI90(9BN)",{"$f":"IFERROR(VLOOKUP($G$6,'Raw data'!$A$2:$W$28,23,0),\"\")","v":"-"},{"$f":"IF(C58=\"-\",\"-\",IF(Q58>I58,\"-\",'Raw data'!H164))","v":"-"},{"$f":"IF(D58=\"-\",\"-\",'Raw data'!P164+'Raw data'!S164)","v":"-"},{"$f":"IF(D58=\"-\",\"-\",D58*E58/1000)","v":"-"},{"$f":"IF(C58=\"-\",\"-\",IF(D58=\"-\",\"-\",$M$44))","v":"-"},{"$f":"IF(D58=\"-\",\"-\",G58/F58)","v":"-"},{"$f":"IFERROR(VLOOKUP($G$6,'Raw data'!$A$30:$W$56,23,0),\"\")","v":"-"},{"$f":"IFERROR(VLOOKUP($G$6,'Raw data'!$A$58:$W$84,23,0),\"\")","v":"-"},{"$f":"IFERROR(VLOOKUP($G$6,'Raw data'!$A$86:$W$112,23,0),\"\")","v":"-"},{"$f":"IFERROR(VLOOKUP($G$6,'Raw data'!$A$114:$W$140,23,0),\"\")","v":"-"},{"$f":"IF(C58=\"-\",\"-\",IF(D58=\"-\",\"-\",'Raw data'!N164))","v":"-"}]
[null,"2835 1W 9V CRI90(9CN)",{"$f":"IFERROR(VLOOKUP($G$6,'Raw data'!$A$2:$X$28,24,0),\"\")","v":"-"},{"$f":"IF(C59=\"-\",\"-\",IF(Q59>I59,\"-\",'Raw data'!H165))","v":"-"},{"$f":"IF(D59=\"-\",\"-\",'Raw data'!P165+'Raw data'!S165)","v":"-"},{"$f":"IF(D59=\"-\",\"-\",D59*E59/1000)","v":"-"},{"$f":"IF(C59=\"-\",\"-\",IF(D59=\"-\",\"-\",$M$44))","v":"-"},{"$f":"IF(D59=\"-\",\"-\",G59/F59)","v":"-"},{"$f":"IFERROR(VLOOKUP($G$6,'Raw data'!$A$30:$X$56,24,0),\"\")","v":"-"},{"$f":"IFERROR(VLOOKUP($G$6,'Raw data'!$A$58:$X$84,24,0),\"\")","v":"-"},{"$f":"IFERROR(VLOOKUP($G$6,'Raw data'!$A$86:$X$112,24,0),\"\")","v":"-"},{"$f":"IFERROR(VLOOKUP($G$6,'Raw data'!$A$114:$X$140,24,0),\"\")","v":"-"},{"$f":"IF(C59=\"-\",\"-\",IF(D59=\"-\",\"-\",'Raw data'!N165))","v":"-"}]
[null,"2835 1W 12V Gen2",{"$f":"IFERROR(VLOOKUP($G$6,'Raw data'!$A$2:$N$28,6,0),\"\")","v":"BXEN-27E-14H-12B-00-0-0"},{"$f":"IF(C60=\"-\",\"-\",IF(Q60>I60,\"-\",'Raw data'!H146))","v":67.837784966064334},{"$f":"IF(D60=\"-\",\"-\",'Raw data'!P146+'Raw data'!S146)","v":12.029448523185101},0.81605114217617103,107,131.1192331826926,{"$f":"IFERROR(VLOOKUP($G$6,'Raw data'!$A$30:$N$56,2,0),\"\")","v":100},{"$f":"IFERROR(VLOOKUP($G$6,'Raw data'!$A$58:$N$84,6,0),\"\")","v":75},{"$f":"IFERROR(VLOOKUP($G$6,'Raw data'!$A$86:$N$112,6,0),\"\")","v":118},{"$f":"IFERROR(VLOOKUP($G$6,'Raw data'!$A$114:$N$140,6,0),\"\")","v":129},{"$f":"IF(C60=\"-\",\"-\",IF(D60=\"-\",\"-\",'Raw data'!N146))","v":33.065260250486446},null,null,null,{"$f":"'Raw data'!H146","v":67.837784966064334}]
[null,"2835 1W 18V",{"$f":"IFERROR(VLOOKUP($G$6,'Raw data'!$A$2:$O$28,15,0),\"\")","v":"BXEN-27E-11H-18A-00-0-0"},{"$f":"IF(C61=\"-\",\"-\",IF(Q61>I61,\"-\",'Raw data'!H155))","v":45.692209951849726},{"$f":"IF(D61=\"-\",\"-\",'Raw data'!P155+'Raw data'!S155)","v":18.130744776799503},{"$f":"IF(D61=\"-\",\"-\",D61*E61/1000)","v":0.82843379692492569},{"$f":"IF(C61=\"-\",\"-\",IF(D61=\"-\",\"-\",$M$44))","v":107},{"$f":"IF(D61=\"-\",\"-\",G61/F61)","v":129.15938533311257},{"$f":"IFERROR(VLOOKUP($G$6,'Raw data'!$A$30:$O$56,15,0),\"\")","v":60},{"$f":"IFERROR(VLOOKUP($G$6,'Raw data'!$A$58:$O$84,15,0),\"\")","v":50},{"$f":"IFERROR(VLOOKUP($G$6,'Raw data'!$A$86:$O$112,15,0),\"\")","v":120},{"$f":"IFERROR(VLOOKUP($G$6,'Raw data'!$A$114:$O$140,15,0),\"\")","v":133},{"$f":"IF(C61=\"-\",\"-\",IF(D61=\"-\",\"-\",'Raw data'!N147))","v":34.308639738302169},null,null,null,{"$f":"'Raw data'!H155","v":45.692209951849726}]
[null,"3030 1W 6V",{"$f":"IFERROR(VLOOKUP($G$6,'Raw data'!$A$2:$N$28,7,0),\"\")","v":"BXEM-27E0000-0-000"},{"$f":"IF(C62=\"-\",\"-\",IF(Q62>I62,\"-\",'Raw data'!H147))","v":128.85262711657049},{"$f":"IF(D62=\"-\",\"-\",'Raw data'!P147+'Raw data'!S147)","v":6.1291740341320891},0.78976017635258811,107,135.48416747748229,{"$f":"IFERROR(VLOOKUP($G$6,'Raw data'!$A$30:$N$56,7,0),\"\")","v":240},{"$f":"IFERROR(VLOOKUP($G$6,'Raw data'!$A$58:$N$84,7,0),\"\")","v":150},{"$f":"IFERROR(VLOOKUP($G$6,'Raw data'!$A$86:$N$112,7,0),\"\")","v":125},{"$f":"IFERROR(VLOOKUP($G$6,'Raw data'!$A$114:$N$140,7,0),\"\")","v":133},{"$f":"IF(C62=\"-\",\"-\",IF(D62=\"-\",\"-\",'Raw data'!N147))","v":34.308639738302169},null,null,null,{"$f":"'Raw data'!H147","v":128.85262711657049}]
[null,"3031 1W 6V(S)",{"$f":"IFERROR(VLOOKUP($G$6,'Raw data'!$A$2:$Y$28,25,0),\"\")","v":"BXEM-27E12H-6A-00-0-0"},{"$f":"IF(C63=\"-\",\"-\",IF(Q63>I63,\"-\",'Raw data'!H166))","v":119.42242793609996},{"$f":"IF(D63=\"-\",\"-\",'Raw data'!P166+'Raw data'!S166)","v":5.8472386390319073},0.69829143499496715,107,153.231150545003,{"$f":"IFERROR(VLOOKUP($G$6,'Raw data'!$A$30:$Y$56,25,0),\"\")","v":240},{"$f":"IFERROR(VLOOKUP($G$6,'Raw data'!$A$58:$Y$84,25,0),\"\")","v":150},{"$f":"IFERROR(VLOOKUP($G$6,'Raw data'!$A$86:$Y$112,25,0),\"\")","v":133},{"$f":"IFERROR(VLOOKUP($G$6,'Raw data'!$A$114:$Y$140,25,0),\"\")","v":146},{"$f":"IF(C63=\"-\",\"-\",IF(D63=\"-\",\"-\",'Raw data'!N166))","v":33.274416506712086}]
[null,"5050 1W 24V",{"$f":"IFERROR(VLOOKUP($G$6,'Raw data'!$A$2:$N$28,8,0),\"\")","v":"BXEP-27E-181-24A-00-00-0 "},{"$f":"IF(C64=\"-\",\"-\",IF(Q64>I64,\"-\",'Raw data'!H148))","v":29.355517085014391},{"$f":"IF(D64=\"-\",\"-\",'Raw data'!P148+'Raw data'!S148)","v":21.547890345691641},0.63254946318896754,107,169.15673196616856,{"$f":"IFERROR(VLOOKUP($G$6,'Raw data'!$A$30:$N$56,8,0),\"\")","v":240},{"$f":"IFERROR(VLOOKUP($G$6,'Raw data'!$A$58:$N$84,8,0),\"\")","v":45},{"$f":"IFERROR(VLOOKUP($G$6,'Raw data'!$A$86:$N$112,8,0),\"\")","v":163},{"$f":"IFERROR(VLOOKUP($G$6,'Raw data'!$A$114:$N$140,8,0),\"\")","v":165},{"$f":"IF(C64=\"-\",\"-\",IF(D64=\"-\",\"-\",'Raw data'!N148))","v":26.959758968012729},null,null,null,{"$f":"'Raw data'!H148","v":29.355517085014391}]
[null,"5050 3W 9V",{"$f":"IFERROR(VLOOKUP($G$6,'Raw data'!$A$2:$N$28,9,0),\"\")","v":"BXEP-27E-233-09A-00-00-0"},{"$f":"IF(C65=\"-\",\"-\",IF(Q65>I65,\"-\",'Raw data'!H149))","v":79.823509276836461},{"$f":"IF(D65=\"-\",\"-\",'Raw data'!P149+'Raw data'!S149)","v":8.2619171838127947},0.65949522296653518,107,162.24529954696808,{"$f":"IFERROR(VLOOKUP($G$6,'Raw data'!$A$30:$N$56,9,0),\"\")","v":480},{"$f":"IFERROR(VLOOKUP($G$6,'Raw data'!$A$58:$N$84,9,0),\"\")","v":320},{"$f":"IFERROR(VLOOKUP($G$6,'Raw data'!$A$86:$N$112,9,0),\"\")","v":389},{"$f":"IFERROR(VLOOKUP($G$6,'Raw data'!$A$114:$N$140,9,0),\"\")","v":131},{"$f":"IF(C65=\"-\",\"-\",IF(D65=\"-\",\"-\",'Raw data'!N149))","v":27.170443087681349},null,null,null,{"$f":"'Raw data'!H149","v":79.823509276836461}]
[null,"5050 3W 18V",{"$f":"IFERROR(VLOOKUP($G$6,'Raw data'!$A$2:$N$28,10,0),\"\")","v":"BXEP-27E-163-18A-00-00-0"},{"$f":"IF(C66=\"-\",\"-\",IF(Q66>I66,\"-\",'Raw data'!H150))","v":39.910335594062587},{"$f":"IF(D66=\"-\",\"-\",'Raw data'!P150+'Raw data'!S150)","v":16.503495770722836},0.65866005468474098,107,162.45102346644379,{"$f":"IFERROR(VLOOKUP($G$6,'Raw data'!$A$30:$N$56,10,0),\"\")","v":240},{"$f":"IFERROR(VLOOKUP($G$6,'Raw data'!$A$58:$N$84,10,0),\"\")","v":160},{"$f":"IFERROR(VLOOKUP($G$6,'Raw data'!$A$86:$N$112,10,0),\"\")","v":389},{"$f":"IFERROR(VLOOKUP($G$6,'Raw data'!$A$114:$N$140,10,0),\"\")","v":131},{"$f":"IF(C66=\"-\",\"-\",IF(D66=\"-\",\"-\",'Raw data'!N150))","v":27.170359792048156},null,null,null,{"$f":"'Raw data'!H150","v":39.910335594062587}]
[null,"5050 5W 9V",{"$f":"IFERROR(VLOOKUP($G$6,'Raw data'!$A$2:$N$28,11,0),\"\")","v":"BXEP-27E-435-09A-00-00-0"},{"$f":"IF(C67=\"-\",\"-\",IF(Q67>I67,\"-\",'Raw data'!H151))","v":82.625095480984783},{"$f":"IF(D67=\"-\",\"-\",'Raw data'!P151+'Raw data'!S151)","v":8.0662262320188827},0.66647271259178431,107,160.54670803234774,{"$f":"IFERROR(VLOOKUP($G$6,'Raw data'!$A$30:$N$56,11,0),\"\")","v":800},{"$f":"IFERROR(VLOOKUP($G$6,'Raw data'!$A$58:$N$84,11,0),\"\")","v":500},{"$f":"IFERROR(VLOOKUP($G$6,'Raw data'!$A$86:$N$112,11,0),\"\")","v":579},{"$f":"IFERROR(VLOOKUP($G$6,'Raw data'!$A$114:$N$140,11,0),\"\")","v":125},{"$f":"IF(C67=\"-\",\"-\",IF(D67=\"-\",\"-\",'Raw data'!N151))","v":26.2641037407219},null,null,null,{"$f":"'Raw data'!H151","v":82.625095480984783}]
[null,"5050 5W 36V",{"$f":"IFERROR(VLOOKUP($G$6,'Raw data'!$A$2:$N$28,12,0),\"\")","v":"BXEP-27E-1C5-36A-00-00-0"},{"$f":"IF(C68=\"-\",\"-\",IF(Q68>I68,\"-\",'Raw data'!H152))","v":20.655816150270436},{"$f":"IF(D68=\"-\",\"-\",'Raw data'!P152+'Raw data'!S152)","v":32.264877155230906},0.66645737062951016,107,160.55040384493293,{"$f":"IFERROR(VLOOKUP($G$6,'Raw data'!$A$30:$N$56,12,0),\"\")","v":200},{"$f":"IFERROR(VLOOKUP($G$6,'Raw data'!$A$58:$N$84,12,0),\"\")","v":125},{"$f":"IFERROR(VLOOKUP($G$6,'Raw data'!$A$86:$N$112,12,0),\"\")","v":579},{"$f":"IFERROR(VLOOKUP($G$6,'Raw data'!$A$114:$N$140,12,0),\"\")","v":125},{"$f":"IF(C68=\"-\",\"-\",IF(D68=\"-\",\"-\",'Raw data'!N152))","v":26.264074447930589},null,null,null,{"$f":"'Raw data'!H152","v":20.655816150270436}]
[null,"5050 5W 9V Gen2",{"$f":"IFERROR(VLOOKUP($G$6,'Raw data'!$A$2:$N$28,13,0),\"\")","v":"BXEP-27E-435-09B-00-00-0"},{"$f":"IF(C69=\"-\",\"-\",IF(Q69>I69,\"-\",'Raw data'!H153))","v":81.198715149358904},{"$f":"IF(D69=\"-\",\"-\",'Raw data'!P153+'Raw data'!S153)","v":7.9650177704480516},0.64674920910219302,107,165.44279992013551,{"$f":"IFERROR(VLOOKUP($G$6,'Raw data'!$A$30:$N$56,13,0),\"\")","v":960},{"$f":"IFERROR(VLOOKUP($G$6,'Raw data'!$A$58:$N$84,13,0),\"\")","v":500},{"$f":"IFERROR(VLOOKUP($G$6,'Raw data'!$A$86:$N$112,13,0),\"\")","v":615},{"$f":"IFERROR(VLOOKUP($G$6,'Raw data'!$A$114:$N$140,13,0),\"\")","v":139},{"$f":"IF(C69=\"-\",\"-\",IF(D69=\"-\",\"-\",'Raw data'!N153))","v":26.227056876068989},null,null,null,{"$f":"'Raw data'!H153","v":81.198715149358904}]
[null,"5050 5W 36V Gen2",{"$f":"IFERROR(VLOOKUP($G$6,'Raw data'!$A$2:$N$28,14,0),\"\")","v":"BXEP-27E-1C5-36B-00-00-0"},{"$f":"IF(C70=\"-\",\"-\",IF(Q70>I70,\"-\",'Raw data'!H154))","v":20.299617626299707},{"$f":"IF(D70=\"-\",\"-\",'Raw data'!P154+'Raw data'!S154)","v":31.770906456599128},0.64493725270989888,107,165.90761279551947,{"$f":"IFERROR(VLOOKUP($G$6,'Raw data'!$A$30:$N$56,14,0),\"\")","v":240},{"$f":"IFERROR(VLOOKUP($G$6,'Raw data'!$A$58:$N$84,14,0),\"\")","v":125},{"$f":"IFERROR(VLOOKUP($G$6,'Raw data'!$A$86:$N$112,14,0),\"\")","v":615},{"$f":"IFERROR(VLOOKUP($G$6,'Raw data'!$A$114:$N$140,14,0),\"\")","v":139},{"$f":"IF(C70=\"-\",\"-\",IF(D70=\"-\",\"-\",'Raw data'!N154))","v":26.223622474937109},null,null,null,{"$f":"'Raw data'!H154","v":20.299617626299707}]

{"sheet":"Raw data","index":2,"n_rows":296,"n_cols":25,"rows_kept":296,"cut":false,"hidden":true,"merged":[[296,0,300,0],[301,0,305,0],[306,0,310,0],[311,0,315,0],[316,0,320,0],[271,0,275,0],[276,0,280,0],[281,0,285,0],[286,0,290,0],[291,0,295,0],[171,0,175,0],[176,0,180,0],[181,0,185,0],[186,0,190,0],[191,0,195,0],[196,0,200,0],[201,0,205,0],[206,0,210,0],[211,0,215,0],[216,0,220,0],[261,0,265,0],[266,0,270,0],[221,0,225,0],[226,0,230,0],[231,0,235,0],[251,0,255,0],[256,0,260,0],[246,0,250,0],[241,0,245,0],[236,0,240,0]]}
["Color Temperature and CRI:","2835 0.2W 3V","2835 0.5W 3V Gen3","2835 0.5W 3V","2835 1W 9V Gen2","2835 1W 12V","3030 1W 6V","5050 1W 24V","5050 3W 9V","5050 3W 18V","5050 5W 9V","5050 5W 36V","5050 5W 9V Gen2","5050 5W 36V Gen2","2835 1W 18V","2835 0.2W 3V L","2835 1W 9V L","2835 1W 9V Gen3","2835 0.5W 3V Gen1","2835 0.5W 3V Gen2","2835 0.6W 6V ","2835 1W 9V CRI90","2835 1W 9V CRI90","2835 1W 9V CRI90","3030 1W 6V(S)"]
["2200K,80 CRI","-","-","-","-","-","-","-","-","-","-","-","-","-","-","-","-","-","-","-","-","-","-","-","BXEM-22E-12H-6A-00-0-0"]
["2700K, 70 CRI","-","-","-","-","-","BXEM-27C0000-0-000","BXEP-27C-181-24A-00-00-0 ","-","-","-","-","BXEP-27C-435-09B-00-00-0","BXEP-27C-1C5-36B-00-00-0","-","-","-","-","-","-","-","-","-","-","BXEM-27C-12H-6A-00-0-0"]
["2700K, 80 CRI","BXEN-27E-11L-3AA-00-0-0","BXEN-27E-11M-3CA-00-0-0","BXEN-27E-11M-39A-00-0-0","BXEN-27E-13H-9B-00-0-0","BXEN-27E-14H-12B-00-0-0","BXEM-27E0000-0-000","BXEP-27E-181-24A-00-00-0 ","BXEP-27E-233-09A-00-00-0","BXEP-27E-163-18A-00-00-0","BXEP-27E-435-09A-00-00-0","BXEP-27E-1C5-36A-00-00-0","BXEP-27E-435-09B-00-00-0","BXEP-27E-1C5-36B-00-00-0","BXEN-27E-11H-18A-00-0-0","BXEN-27E-11L-37A-00-0-0","BXEN-27E-13H-98-00-0-0","BXEN-27E-13H-9C-00-0-0","BXEN-27E-11M-3A-00-0-0","BXEN-27E-11M-3AA-00-00-0","BXEN-27E-12M-6A-00-0-0","-","-","-","BXEM-27E12H-6A-00-0-0"]
["2700K, 90 CRI","-","-","-","BXEN-27G-13H-9B-00-0-0","BXEN-27G-14H-12B-00-0-0","BXEM-27G0000-0-000","BXEP-27G-181-24A-00-00-0 ","-","-","-","-","BXEP-27G-435-09B-00-00-0","BXEP-27G-1C5-36B-00-00-0","BXEN-27G-11H-18A-00-0-0","-","-","BXEN-27G-13H-9C-00-0-0","BXEN-27G-11M-3A-00-0-0","-","-","BXEN-27G-13H-99N-00-0-0","BXEN-27G-13H-9BN-00-0-0","BXEN-27G-13H-9CN-00-0-0","BXEM-27G-12H-6A-00-0-0"]
["2700K, 94 CRI","-","-","-","-","-","-","BXEP-27H-181-24A-00-00-0 ","-","-","-","-","-","-","-","-","-","-","-","-","-","-","-","-","-"]
["3000K, 70 CRI","-","-","-","-","-","BXEM-30C0000-0-000","BXEP-30C-181-24A-00-00-0 ","-","-","-","-","BXEP-30C-435-09B-00-00-0","BXEP-30C-1C5-36B-00-00-0","-","-","-","-","-","-","-","-","-","-","BXEM-30C-12H-6A-00-0-0"]
["3000K, 80 CRI","BXEN-30E-11L-3AA-00-0-0","BXEN-30E-11M-3CA-00-0-0","BXEN-30E-11M-39A-00-0-0","BXEN-30E-13H-9B-00-0-0","BXEN-30E-14H-12B-00-0-0","BXEM-30E0000-0-000","BXEP-30E-181-24A-00-00-0 ","BXEP-30E-233-09A-00-00-0","BXEP-30E-163-18A-00-00-0","BXEP-30E-435-09A-00-00-0","BXEP-30E-1C5-36A-00-00-0","BXEP-30E-435-09B-00-00-0","BXEP-30E-1C5-36B-00-00-0","BXEN-30E-11H-18A-00-0-0","BXEN-30E-11L-37A-00-0-0","BXEN-30E-13H-98-00-0-0","BXEN-30E-13H-9C-00-0-0","BXEN-30E-11M-3A-00-0-0","BXEN-30E-11M-3AA-00-00-0","BXEN-30E-12M-6A-00-0-0","-","-","-","BXEM-30E-12H-6A-00-0-0"]
["3000K, 90 CRI","-","-","-","BXEN-30G-13H-9B-00-0-0","BXEN-30G-14H-12B-00-0-0","BXEM-30G0000-0-000","BXEP-30G-181-24A-00-00-0 ","-","-","-","-","BXEP-30G-435-09B-00-00-0","BXEP-30G-1C5-36B-00-00-0","BXEN-30G-11H-18A-00-0-0","-","-","BXEN-30G-13H-9C-00-0-0","BXEN-30G-11M-3A-00-0-0","-","-","BXEN-30G-13H-99N-00-0-0","BXEN-30G-13H-9BN-00-0-0","BXEN-30G-13H-9CN-00-0-0","BXEM-30G-12H-6A-00-0-0"]
["3500K, 70 CRI","-","-","-","-","-","BXEM-35C0000-0-000","BXEP-35C-181-24A-00-00-0 ","-","-","-","-","BXEP-35C-435-09B-00-00-0","BXEP-35C-1C5-36B-00-00-0","-","-","-","-","-","-","-","-","-","-","BXEM-35C-12H-6A-00-0-0"]
["3500K, 80 CRI","BXEN-35E-11L-3AA-00-0-0","BXEN-35E-11M-3CA-00-0-0","BXEN-35E-11M-39A-00-0-0","BXEN-35E-13H-9B-00-0-0","BXEN-35E-14H-12B-00-0-0","BXEM-35E0000-0-000","BXEP-35E-181-24A-00-00-0 ","BXEP-35E-233-09A-00-00-0","BXEP-35E-163-18A-00-00-0","BXEP-35E-435-09A-00-00-0","BXEP-35E-1C5-36A-00-00-0","BXEP-35E-435-09B-00-00-0","BXEP-35E-1C5-36B-00-00-0","BXEN-35E-11H-18A-00-0-0","BXEN-35E-11L-37A-00-0-0","BXEN-35E-13H-98-00-0-0","BXEN-35E-13H-9C-00-0-0","BXEN-35E-11M-3A-00-0-0","BXEN-35E-11M-3AA-00-00-0","BXEN-35E-12M-6A-00-0-0","-","-","-","BXEM-35E-12H-6A-00-0-0"]
["3500K, 90 CRI","-","-",null,"BXEN-35G-13H-9B-00-0-0","BXEN-35G-14H-12B-00-0-0","BXEM-35G0000-0-000","-","-","-","-","-","-","-","BXEN-35G-11H-18A-00-0-0","-","-","BXEN-35G-13H-9C-00-0-0","BXEN-35G-11M-3A-00-0-0","-","-","BXEN-35G-13H-99N-00-0-0","BXEN-35G-13H-9BN-00-0-0","BXEN-35G-13H-9CN-00-0-0","BXEM-35G-12H-6A-00-0-0"]
["4000K, 70 CRI","-","-","-","-","-","BXEM-40C0000-0-000","BXEP-40C-181-24A-00-00-0 ","-","-","-","-","BXEP-40C-435-09B-00-00-0","BXEP-40C-1C5-36B-00-00-0","-","-","-","-","-","-","-","-","-","-","BXEM-40C-12H-6A-00-0-0"]
["4000K, 80 CRI","BXEN-40E-11L-3AA-00-0-0","BXEN-40E-11M-3CA-00-0-0","BXEN-40E-11M-39A-00-0-0","BXEN-40E-13H-9B-00-0-0","BXEN-40E-14H-12B-00-0-0","BXEM-40E0000-0-000","BXEP-40E-181-24A-00-00-0 ","BXEP-40E-233-09A-00-00-0","BXEP-40E-163-18A-00-00-0","BXEP-40E-435-09A-00-00-0","BXEP-40E-1C5-36A-00-00-0","BXEP-40E-435-09B-00-00-0","BXEP-40E-1C5-36B-00-00-0","BXEN-40E-11H-18A-00-0-0","BXEN-40E-11L-37A-00-0-0","BXEN-40E-13H-98-00-0-0","BXEN-40E-13H-9C-00-0-0","BXEN-40E-11M-3A-00-0-0","BXEN-40E-11M-3AA-00-00-0","BXEN-40E-12M-6A-00-0-0","-","-","-","BXEM-40E-12H-6A-00-0-0"]
["4000K, 90 CRI","-","-","-","BXEN-40G-13H-9B-00-0-0","BXEN-40G-14H-12B-00-0-0","BXEM-40G0000-0-000","BXEP-40G-181-24A-00-00-0 ","-","-","-","-","BXEP-40G-435-09B-00-00-0","BXEP-40G-1C5-36B-00-00-0","BXEN-40G-11H-18A-00-0-0","-","-","BXEN-40G-13H-9C-00-0-0","BXEN-40G-11M-3A-00-0-0","-","-","BXEN-40G-13H-99N-00-0-0","BXEN-40G-13H-9BN-00-0-0","BXEN-40G-13H-9CN-00-0-0","BXEM-40G-12H-6A-00-0-0"]
["4000K, 94 CRI","-","-","-","-","-","-","BXEP-40H-181-24A-00-00-0 ","-","-","-","-","-","-","-","-","-","-","-","-","-","-","-","-","-"]
["4500K, 70 CRI","-","-","-","-","-","-","BXEP-45C-181-24A-00-00-0 ","-","-","-","-","BXEP-45C-435-09B-00-00-0","BXEP-45C-1C5-36B-00-00-0","-","-","-","-","-","-","-","-","-","-","BXEM-45C-12H-6A-00-0-0"]
["4500K, 80 CRI","-","-","-","-","-","-","BXEP-45E-181-24A-00-00-0 ","-","-","-","-","BXEP-45E-435-09B-00-00-0","BXEP-45E-1C5-36B-00-00-0","-","-","-","-","-","-","-","-","-","-","BXEM-45E-12H-6A-00-0-0"]
["4500K, 90 CRI","-","-","-","-","-","-","-","-","-","-","-","-",null,"-","-","-","-","-","-","-","-","-","-","BXEM-45G-12H-6A-00-0-0"]
["5000K, 70 CRI","-","-","-","-","-","BXEM-50C0000-0-000","BXEP-50C-181-24A-00-00-0 ","-","-","-","-","BXEP-50C-435-09B-00-00-0","BXEP-50C-1C5-36B-00-00-0","-","-","-","-","-","-","-","-","-","-","BXEM-50C-12H-6A-00-0-0"]
["5000K, 80 CRI","BXEN-50E-11L-3AA-00-0-0","BXEN-50E-11M-3CA-00-0-0","BXEN-50E-11M-39A-00-0-0","BXEN-50E-13H-9B-00-0-0","BXEN-50E-14H-12B-00-0-0","BXEM-50E0000-0-000","BXEP-50E-181-24A-00-00-0 ","BXEP-50E-233-09A-00-00-0","BXEP-50E-163-18A-00-00-0","BXEP-50E-435-09A-00-00-0","BXEP-50E-1C5-36A-00-00-0","BXEP-50E-435-09B-00-00-0","BXEP-50E-1C5-36B-00-00-0","BXEN-50E-11H-18A-00-0-0","BXEN-50E-11L-37A-00-0-0","BXEN-50E-13H-98-00-0-0","BXEN-50E-13H-9C-00-0-0","BXEN-50E-11M-3A-00-0-0","BXEN-50E-11M-3AA-00-00-0","BXEN-50E-12M-6A-00-0-0","-","-","-","BXEM-50E-12H-6A-00-0-0"]
["5000K, 90 CRI","-","-","-","BXEN-50G13H-9B-00-0-0","BXEN-50G-14H-12B-00-0-0","BXEM-50G0000-0-000","-","-","-","-","-","-","-","BXEN-50G-11H-18A-00-0-0","-","-","BXEN-50G-13H-9C-00-0-0","BXEN-50G-11M-3A-00-0-0","-","-","BXEN-50G-13H-99N-00-0-0","BXEN-50G-13H-9BN-00-0-0","BXEN-50G-13H-9CN-00-0-0","BXEM-50G-12H-6A-00-0-0"]
["5700K, 70 CRI","-","-","-","-","-","BXEM-57C0000-0-000","BXEP-57C-181-24A-00-00-0 ","-","-","-","-","BXEP-57C-435-09B-00-00-0","BXEP-57C-1C5-36B-00-00-0","-","-","-","-","-","-","-","-","-","-","BXEM-57C-12H-6A-00-0-0"]
["5700K, 80 CRI","BXEN-57E-11L-3AA-00-0-0","BXEN-57E-11M-3CA-00-0-0","BXEN-57E-11M-39A-00-0-0","BXEN-57E-13H-9B-00-0-0","BXEN-57E-14H-12B-00-0-0","BXEM-57E0000-0-000","BXEP-57E-181-24A-00-00-0 ","BXEP-57E-233-09A-00-00-0","BXEP-57E-163-18A-00-00-0","BXEP-57E-435-09A-00-00-0","BXEP-57E-1C5-36A-00-00-0","BXEP-57E-435-09B-00-00-0","BXEP-57E-1C5-36B-00-00-0","BXEN-57E-11H-18A-00-0-0","BXEN-57E-11L-37A-00-0-0","BXEN-57E-13H-98-00-0-0","BXEN-57E-13H-9C-00-0-0","BXEN-57E-11M-3A-00-0-0","BXEN-57E-11M-3AA-00-00-0","BXEN-57E-12M-6A-00-0-0","-","-","-","BXEM-57E-12H-6A-00-0-0"]
["5700K, 90 CRI","-","-","-","BXEN-57G-13H-9B-00-0-0","BXEN-57G-14H-12B-00-0-0","BXEM-57G0000-0-000","-","-","-","-","-","-","-","BXEN-57G-11H-18A-00-0-0","-","-","BXEN-57G-13H-9C-00-0-0","BXEN-57G-11M-3A-00-0-0","-","-","BXEN-57G-13H-99N-00-0-0","BXEN-57G-13H-9BN-00-0-0","BXEN-57G-13H-9CN-00-0-0","BXEM-57G-12H-6A-00-0-0"]
["6500K, 70 CRI","-","-","-","-","-","BXEM-65C0000-0-000","BXEP-65C-181-24A-00-00-0 ","-","-","-","-","BXEP-65C-435-09B-00-00-0","BXEP-65C-1C5-36B-00-00-0","-","-","-","-","-","-","-","-","-","-","BXEM-65C-12H-6A-00-0-0"]
["6500K, 80 CRI","BXEN-65E-11L-3AA-00-0-0","BXEN-65E-11M-3CA-00-0-0","BXEN-65E-11M-39A-00-0-0","BXEN-65E-13H-9B-00-0-0","BXEN-65E-14H-12B-00-0-0","BXEM-65E0000-0-000","BXEP-65E-181-24A-00-00-0 ","BXEP-65E-233-09A-00-00-0","BXEP-65E-163-18A-00-00-0","BXEP-65E-435-09A-00-00-0","BXEP-65E-1C5-36A-00-00-0","BXEP-65E-435-09B-00-00-0","BXEP-65E-1C5-36B-00-00-0","BXEN-65E-11H-18A-00-0-0","BXEN-65E-11L-37A-00-0-0","BXEN-65E-13H-98-00-0-0","BXEN-65E-13H-9C-00-0-0","BXEN-65E-11M-3A-00-0-0","BXEN-65E-11M-3AA-00-00-0","BXEN-65E-12M-6A-00-0-0","-","-","-","BXEM-65E-12H-6A-00-0-0"]
["6500K, 90 CRI","-","-","-","-","-","BXEM-65G0000-0-000","-","-","-","-","-","-","-","-","-","-","-","-","-","-","-","-","-","BXEM-65G-12H-6A-00-0-0"]
["Max. Current"]
["2200K,80 CRI","-","-","-","-","-","-","-","-","-","-","-","-","-","-","-","-","-","-","-","-","-","-","-",240]
["2700K, 70 CRI","-","-","-","-","-",240,240,"-","-","-","-",960,240,"-","-","-","-","-","-","-","-","-","-",240]
["2700K, 80 CRI",100,150,150,120,90,240,240,480,240,800,200,960,240,60,100,120,120,150,150,120,"-","-","-",240]
["2700K, 90 CRI","-","-","-",120,90,240,240,"-","-","-","-",960,240,60,"-","-",120,150,"-","-",120,120,120,240]
["2700K, 94 CRI","-","-","-","-","-","-",240,"-","-","-","-","-","-","-","-","-","-","-","-","-","-","-","-","-"]
["3000K, 70 CRI","-","-","-","-","-",240,240,"-","-","-","-",960,240,"-","-","-","-","-","-","-","-","-","-",240]
["3000K, 80 CRI",100,150,150,120,90,240,240,480,240,800,200,960,240,60,100,120,120,150,150,120,"-","-","-",240]
["3000K, 90 CRI","-","-","-",120,90,240,240,"-","-","-","-",960,240,60,"-","-",120,150,"-","-",120,120,120,240]
["3500K, 70 CRI","-","-","-","-","-",240,240,"-","-","-","-",960,240,"-","-","-","-","-","-","-","-","-","-",240]
["3500K, 80 CRI",100,150,150,120,90,240,240,480,240,800,200,960,240,60,100,120,120,150,150,120,"-","-","-",240]
["3500K, 90 CRI","-","-","-",120,90,240,"-","-","-","-","-","-","-",60,"-","-",120,150,"-","-",120,120,120,240]
["4000K, 70 CRI","-","-","-","-","-",240,240,"-","-","-","-",960,240,"-","-","-","-","-","-","-","-","-","-",240]
["4000K, 80 CRI",100,150,150,120,90,240,240,480,240,800,200,960,240,60,100,120,120,150,150,120,"-","-","-",240]
["4000K, 90 CRI","-","-","-",120,90,240,240,"-","-","-","-",960,240,60,"-","-",120,150,"-","-",120,120,120,240]
["4000K, 94 CRI","-","-","-","-","-","-",240,"-","-","-","-","-","-","-","-","-","-","-","-","-","-","-","-","-"]
["4500K, 70 CRI","-","-","-","-","-","-",240,"-","-","-","-",960,240,"-","-","-","-","-","-","-","-","-","-",240]
["4500K, 80 CRI","-","-","-","-","-","-",240,"-","-","-","-",960,240,"-","-","-","-","-","-","-","-","-","-",240]
["4500K, 90 CRI","-","-","-","-","-","-","-","-","-","-","-","-","-","-","-","-","-","-","-","-","-","-","-",240]
["5000K, 70 CRI","-","-","-","-","-",240,240,"-","-","-","-",960,240,"-","-","-","-","-","-","-","-","-","-",240]
["5000K, 80 CRI",100,150,150,120,90,240,240,480,240,800,200,960,240,60,100,120,120,150,150,120,"-","-","-",240]
["5000K, 90 CRI","-","-","-",120,90,240,"-","-","-","-","-","-","-",60,"-","-",120,150,"-","-",120,120,120,240]
["5700K, 70 CRI","-","-","-","-","-",240,240,"-","-","-","-",960,240,"-","-","-","-","-","-","-","-","-","-",240]
["5700K, 80 CRI",100,150,150,120,90,240,240,480,240,800,200,960,240,60,100,120,120,150,150,120,"-","-","-",240]
["5700K, 90 CRI","-","-","-",120,90,240,"-","-","-","-","-","-","-",60,"-","-",120,150,"-","-",120,120,120,240]
["6500K, 70 CRI","-","-","-","-","-",240,240,"-","-","-","-",960,240,"-","-","-","-","-","-","-","-","-","-",240]
["6500K, 80 CRI",100,150,150,120,90,240,240,480,240,800,200,960,240,60,100,120,120,150,150,120,"-","-","-",240]
["6500K, 90 CRI","-","-","-","-","-",240,"-","-","-","-","-","-","-","-","-","-","-","-","-","-","-","-","-",240]
["Typical Current"]
["2200K,80 CRI","-","-","-","-","-","-","-","-","-","-","-","-","-","-","-","-","-","-","-","-","-","-","-",150]
["2700K, 70 CRI","-","-","-","-","-",150,45,"-","-","-","-",500,125,"-","-","-","-","-","-","-","-","-","-",150]
["2700K, 80 CRI",60,150,150,100,75,150,45,320,160,500,125,500,125,50,60,100,100,150,150,100,"-","-","-",150]
["2700K, 90 CRI","-","-","-",100,75,150,45,"-","-","-","-",500,125,50,"-","-",100,150,"-","-",100,100,100,150]
["2700K, 94 CRI","-","-","-","-","-","-",45,"-","-","-","-","-","-","-","-","-","-","-","-","-","-","-","-","-"]
["3000K, 70 CRI","-","-","-","-","-",150,45,"-","-","-","-",500,125,"-","-","-","-","-","-","-","-","-","-",150]
["3000K, 80 CRI",60,150,150,100,75,150,45,320,160,500,125,500,125,50,60,100,100,150,150,100,"-","-","-",150]
["3000K, 90 CRI","-","-","-",100,75,150,45,"-","-","-","-",500,125,50,"-","-",100,150,"-","-",100,100,100,150]
["3500K, 70 CRI","-","-","-","-","-",150,45,"-","-","-","-",500,125,"-","-","-","-","-","-","-","-","-","-",150]
["3500K, 80 CRI",60,150,150,100,75,150,45,320,160,500,125,500,125,50,60,100,100,150,150,100,"-","-","-",150]
["3500K, 90 CRI","-","-","-",100,75,150,"-","-","-","-","-","-","-",50,"-","-",100,150,"-","-",100,100,100,150]
["4000K, 70 CRI","-","-","-","-","-",150,45,"-","-","-","-",500,125,"-","-","-","-","-","-","-","-","-","-",150]
["4000K, 80 CRI",60,150,150,100,75,150,45,320,160,500,125,500,125,50,60,100,100,150,150,100,"-","-","-",150]
["4000K, 90 CRI","-","-","-",100,75,150,45,"-","-","-","-",500,125,50,"-","-",100,150,"-","-",100,100,100,150]
["4000K, 94 CRI","-","-","-","-","-","-",45,"-","-","-","-","-","-","-","-","-","-","-","-","-","-","-","-","-"]
["4500K, 70 CRI","-","-","-","-","-","-",45,"-","-","-","-",500,125,"-","-","-","-","-","-","-","-","-","-",150]
["4500K, 80 CRI","-","-","-","-","-","-",45,"-","-","-","-",500,125,"-","-","-","-","-","-","-","-","-","-",150]
["4500K, 90 CRI","-","-","-","-","-","-","-","-","-","-","-","-","-","-","-","-","-","-","-","-","-","-","-",150]
["5000K, 70 CRI","-","-","-","-","-",150,45,"-","-","-","-",500,125,"-","-","-","-","-","-","-","-","-","-",150]
["5000K, 80 CRI",60,150,150,100,75,150,45,320,160,500,125,500,125,50,60,100,100,150,150,100,"-","-","-",150]
["5000K, 90 CRI","-","-","-",100,75,150,"-","-","-","-","-","-","-",50,"-","-",100,150,"-","-",100,100,100,150]
["5700K, 70 CRI","-","-","-","-","-",150,45,"-","-","-","-",500,125,"-","-","-","-","-","-","-","-","-","-",150]
["5700K, 80 CRI",60,150,150,100,75,150,45,320,160,500,125,500,125,50,60,100,100,150,150,100,"-","-","-",150]
["5700K, 90 CRI","-","-","-",100,75,150,"-","-","-","-","-","-","-",50,"-","-",100,150,"-","-",100,100,100,150]
["6500K, 70 CRI","-","-","-","-","-",150,45,"-","-","-","-",500,125,"-","-","-","-","-","-","-","-","-","-",150]
["6500K, 80 CRI",60,150,150,100,75,150,45,320,160,500,125,500,125,50,60,100,100,150,150,100,"-","-","-",150]
["6500K, 90 CRI","-","-","-","-","-",150,"-","-","-","-","-","-","-","-","-","-","-","-","-","-","-","-","-",150]
["Typical Flux"]
["2200K,80 CRI","-","-","-","-","-","-","-","-","-","-","-","-","-","-","-","-","-","-","-","-","-","-","-",114]
["2700K, 70 CRI","-","-","-","-","-",137,183,"-","-","-","-",692,692,"-","-","-","-","-","-","-","-","-","-",145]
["2700K, 80 CRI",26,70,60,115,118,125,163,389,389,579,579,615,615,120,24,115,125,62,63,75,"-","-","-",133]
["2700K, 90 CRI","-","-","-",100,103,107,140,"-","-","-","-",520,520,105,"-","-",108,54,"-","-",102,108,115,117]
["2700K, 94 CRI","-","-","-","-","-","-",135,"-","-","-","-","-","-","-","-","-","-","-","-","-","-","-","-","-"]
["3000K, 70 CRI","-","-","-","-","-",143,187,"-","-","-","-",709,709,"-","-","-","-","-","-","-","-","-","-",150]
["3000K, 80 CRI",27,74,64,120,122,129,170,401,401,600,600,630,630,125,26,120,130,64,68,78,"-","-","-",137]
["3000K, 90 CRI","-","-","-",100,107,109,143,"-","-","-","-",535,535,110,"-","-",108,55,"-","-",105,110,116,121]
["3500K, 70 CRI","-","-","-","-","-",144,190,"-","-","-","-",726,726,"-","-","-","-","-","-","-","-","-","-",154]
["3500K, 80 CRI",27,74,64,123,129,132,175,412,412,614,614,650,650,125,26,120,130,64,68,78,"-","-","-",140]
["3500K, 90 CRI","-","-","-",102,114,112,"-","-","-","-","-","-","-",110,"-","-",108,57,"-","-",105,110,116,124]
["4000K, 70 CRI","-","-","-","-","-",145,192,"-","-","-","-",736,736,"-","-","-","-","-","-","-","-","-","-",158]
["4000K, 80 CRI",29,77,70,127,129,136,179,430,430,626,626,670,670,130,28,127,140,70,72,83,"-","-","-",144]
["4000K, 90 CRI","-","-","-",105,114,116,154,"-","-","-","-",575,575,115,"-","-",114,55,"-","-",111,114,121,127]
["4000K, 94 CRI","-","-","-","-","-","-",148,"-","-","-","-","-","-","-","-","-","-","-","-","-","-","-","-","-"]
["4500K, 70 CRI","-","-","-","-","-","-",192,"-","-","-","-",736,736,"-","-","-","-","-","-","-","-","-","-",158]
["4500K, 80 CRI","-","-","-","-","-","-",179,"-","-","-","-",670,670,"-","-","-","-","-","-","-","-","-","-",144]
["4500K, 90 CRI","-","-","-","-","-","-","-","-","-","-","-","-","-","-","-","-","-","-","-","-","-","-","-",127]
["5000K, 70 CRI","-","-","-","-","-",145,192,"-","-","-","-",736,736,"-","-","-","-","-","-","-","-","-","-",158]
["5000K, 80 CRI",29,77,70,127,129,136,179,435,435,629,629,670,670,130,28,127,140,71,72,83,"-","-","-",144]
["5000K, 90 CRI","-","-","-",105,114,116,"-","-","-","-","-","-","-",115,"-","-",114,59,"-","-",111,114,121,127]
["5700K, 70 CRI","-","-","-","-","-",145,192,"-","-","-","-",731,731,"-","-","-","-","-","-","-","-","-","-",155]
["5700K, 80 CRI",29,77,70,127,129,136,177,435,435,629,629,670,670,130,28,127,140,71,72,83,"-","-","-",143]
["5700K, 90 CRI","-","-","-",105,114,116,"-","-","-","-","-","-","-",115,"-","-",114,59,"-","-",111,114,121,126]
["6500K, 70 CRI","-","-","-","-","-",144,190,"-","-","-","-",720,720,"-","-","-","-","-","-","-","-","-","-",153]
["6500K, 80 CRI",29,77,70,125,130,134,176,432,432,624,624,668,668,130,28,127,140,70,72,82,"-","-","-",141]
["6500K, 90 CRI","-","-","-","-","-",114,"-","-","-","-","-","-","-","-","-","-","-","-","-","-","-","-","-",125]
["Typical Eff"]
["2200K,80 CRI","-","-","-","-","-","-","-","-","-","-","-","-","-","-","-","-","-","-","-","-","-","-","-",126]
["2700K, 70 CRI","-","-","-","-","-",146,185,"-","-","-","-",156,156,"-","-","-","-","-","-","-","-","-","-",159]
["2700K, 80 CRI",144,156,125,121,129,133,165,131,131,125,125,139,139,133,133,124,134,125,131,117,"-","-","-",146]
["2700K, 90 CRI","-","-","-",105,112,114,141,"-","-","-","-",117,117,116,"-","-",116,109,"-","-",109,116,125,128]
["2700K, 94 CRI","-","-","-","-","-","-",136,"-","-","-","-","-","-","-","-","-","-","-","-","-","-","-","-","-"]
["3000K, 70 CRI","-","-","-","-","-",153,189,"-","-","-","-",160,160,"-","-","-","-","-","-","-","-","-","-",164]
["3000K, 80 CRI",150,164,133,126,133,138,172,135,135,129,129,142,142,138,144,129,140,129,142,122,"-","-","-",150]
["3000K, 90 CRI","-","-","-",105,117,116,144,"-","-","-","-",121,121,122,"-","-",116,111,"-","-",112,118,126,132]
["3500K, 70 CRI","-","-","-","-","-",154,192,"-","-","-","-",164,164,"-","-","-","-","-","-","-","-","-","-",169]
["3500K, 80 CRI",150,164,133,129,133,141,177,138,138,132,132,146,146,138,144,129,140,129,142,122,"-","-","-",154]
["3500K, 90 CRI","-","-","-",107,117,119,"-","-","-","-","-","-","-",122,"-","-",116,115,"-","-",112,118,126,136]
["4000K, 70 CRI","-","-","-","-","-",155,194,"-","-","-","-",166,166,"-","-","-","-","-","-","-","-","-","-",173]
["4000K, 80 CRI",161,171,146,134,141,145,181,144,144,135,135,151,151,144,156,137,151,140,150,129,"-","-","-",158]
["4000K, 90 CRI","-","-","-",111,125,124,156,"-","-","-","-",130,130,127,"-","-",123,111,"-","-",118,123,132,139]
["4000K, 94 CRI","-","-","-","-","-","-",150,"-","-","-","-","-","-","-","-","-","-","-","-","-","-","-","-","-"]
["4500K, 70 CRI","-","-","-","-","-","-",194,"-","-","-","-",166,166,"-","-","-","-","-","-","-","-","-","-",173]
["4500K, 80 CRI","-","-","-","-","-","-",181,"-","-","-","-",151,151,"-","-","-","-","-","-","-","-","-","-",158]
["4500K, 90 CRI","-","-","-","-","-","-","-","-","-","-","-","-","-","-","-","-","-","-","-","-","-","-","-",139]
["5000K, 70 CRI","-","-","-","-","-",155,194,"-","-","-","-",166,166,"-","-","-","-","-","-","-","-","-","-",173]
["5000K, 80 CRI",161,171,146,134,141,145,181,146,146,135,135,151,151,144,156,137,151,143,150,129,"-","-","-",158]
["5000K, 90 CRI","-","-","-",111,125,124,"-","-","-","-","-","-","-",127,"-","-",123,119,"-","-",118,123,132,139]
["5700K, 70 CRI","-","-","-","-","-",155,194,"-","-","-","-",165,165,"-","-","-","-","-","-","-","-","-","-",170]
["5700K, 80 CRI",161,171,146,134,141,145,179,146,146,135,135,151,151,144,156,137,151,143,150,129,"-","-","-",156]
["5700K, 90 CRI","-","-","-",111,125,124,"-","-","-","-","-","-","-",127,"-","-",123,119,"-","-",118,123,132,139]
["6500K, 70 CRI","-","-","-","-","-",154,192,"-","-","-","-",162,162,"-","-","-","-","-","-","-","-","-","-",168]
["6500K, 80 CRI",161,171,146,132,142,143,178,145,145,134,134,151,151,144,156,137,151,141,150,128,"-","-","-",155]
["6500K, 90 CRI","-","-","-","-","-",122,"-","-","-","-","-","-","-","-","-","-","-","-","-","-","-","-","-",137]
["Calculation"]
["Products","mA","Tjs","mA-Vf","mA-Flux","Tj-Vf","Tj-Flux","Flux-mA","Tj","Target Lum","Typical Lum","%","mA-Vf-2","Tj2","Tj-Flux 2","Tj-vf","Flux-mA-2",-0.02,"ma-vf-3"]
["2835 0.2W 3V",{"$f":"Simulator!$M$14","v":120},25,{"$f":"D172*$B$143^4+D173*$B$143^3+D174*$B$143^2+D175*$B$143+D176","v":3.1895985408},{"$f":"E172*$B$143^4+E173*$B$143^3+E174*$B$143^2+E175*$B$143+E176","v":1.8106394024000001},{"$f":"F172*$I$143^4+F173*$I$143^3+F174*$I$143^2+F175*$I$143+F176","v":-1.6339585680397103E-2},{"$f":"G172*$I$143^4+G173*$I$143^3+G174*$I$143^2+G175*$I$143+G176","v":0.986558992188724},{"$f":"IF(N143<0,\"-\",H172*L143^4+H173*L143^3+H174*L143^2+H175*L143+H176)","v":450.41582158225867},{"$f":"Simulator!$G$8+C143*B143*D143/1000","v":34.568795622400003},{"$f":"Simulator!$M$44","v":107},{"$f":"Simulator!K47","v":26},{"$f":"J143/K143/O143","v":4.1333601215577795},{"$f":"M172*Q143^4+M173*Q143^3+M174*Q143^2+M175*Q143+M176","v":0.29300573897574989},{"$f":"Simulator!$G$8+C143*M143*Q143/1000","v":28.267246399621342},{"$f":"O172*N143^4+O173*N143^3+O174*N143^2+O175*N143+O176","v":0.99565111540138673},{"$f":"P172*$N$143^4+P173*$N$143^3+P174*$N$143^2+P175*$N$143+P176","v":-5.8307460239004905E-3},{"$f":"Q172*R143^4+Q173*R143^3+Q174*R143^2+Q175*R143+Q176","v":446.03172771189293},{"$f":"J143/K143","v":4.115384615384615},{"$f":"S172*H143^4+S173*H143^3+S174*H143^2+S175*H143+S176","v":8.5091294685239127E-2}]
["2835 0.5W 3V",{"$f":"Simulator!$M$14","v":120},12,{"$f":"D182*B144^4+D183*B144^3+D184*B144^2+D185*B144+D186","v":3.1266028287999998},{"$f":"E182*B144^4+E183*B144^3+E184*B144^2+E185*B144+E186","v":0.83063226576000015},{"$f":"F182*I144^4+F183*I144^3+F184*I144^2+F185*I144+F186","v":-5.5754019730450272E-3},{"$f":"G182*I144^4+G183*I144^3+G184*I144^2+G185*I144+G186","v":0.99123692065520297},{"$f":"IF(L144>5,\"-\",IF(M144<0,\"-\",H182*L144^4+H183*L144^3+H184*L144^2+H185*L144+H186))","v":340.13689427510963},{"$f":"Simulator!$G$8+C144*B144*D144/1000","v":29.502308073472001},{"$f":"Simulator!$M$44","v":107},{"$f":"Simulator!K49","v":60},{"$f":"J144/K144/O144","v":1.7973852530744423},{"$f":"M182*Q144^4+M183*Q144^3+M184*Q144^2+M185*Q144+M186","v":0.9964534839994541},{"$f":"Simulator!$G$8+C144*M144*Q144/1000","v":29.015079763874347},{"$f":"O182*N144^4+O183*N144^3+O184*N144^2+O185*N144+O186","v":0.9921820212349729},{"$f":"P182*N144^4+P183*N144^3+P184*N144^2+P185*N144+P186","v":-4.9973878917272466E-3},{"$f":"Q182*R144^4+Q183*R144^3+Q184*R144^2+Q185*R144+Q186","v":335.78083241770833},{"$f":"J144/K144","v":1.7833333333333334},{"$f":"S182*H144^4+S183*H144^3+S184*H144^2+S185*H144+S186","v":0.79315207909247532}]
["2835 1W 9V Gen2",{"$f":"Simulator!$M$14","v":120},10,{"$f":"D187*B145^4+D188*B145^3+D189*B145^2+D190*B145+D191","v":9.7597586239999998},{"$f":"E187*B145^4+E188*B145^3+E189*B145^2+E190*B145+E191","v":1.1647935728000001},{"$f":"F187*I145^4+F188*I145^3+F189*I145^2+F190*I145+F191","v":-4.0085814181145818E-2},{"$f":"G187*I145^4+G188*I145^3+G189*I145^2+G190*I145+G191","v":0.97862853678098394},{"$f":"IF(M145<0,\"-\",H187*L145^4+H188*L145^3+H189*L145^2+H190*L145+H191)","v":93.674773562656},{"$f":"Simulator!$G$8+C145*B145*D145/1000","v":36.711710348799997},{"$f":"Simulator!$M$44","v":107},{"$f":"Simulator!K55","v":115},0.94562732150093831,{"$f":"M187*Q145^4+M188*Q145^3+M189*Q145^2+M190*Q145+M191","v":9.3923193335884712},{"$f":"Simulator!$G$8+C145*M145*Q145/1000","v":33.634363388386674},{"$f":"O187*N145^4+O188*N145^3+O189*N145^2+O190*N145+O191","v":0.98393390446023865},{"$f":"P187*N145^4+P188*N145^3+P189*N145^2+P190*N145+P191","v":-2.904484735722343E-2},{"$f":"Q187*R145^4+Q188*R145^3+Q189*R145^2+Q190*R145+Q191","v":91.930044983764347},0.93043478260869561,{"$f":"S187*H145^4+S188*H145^3+S189*H145^2+S190*H145+S191","v":9.4159351005081788}]
["2835 1W 12V",{"$f":"Simulator!$M$14","v":120},10,{"$f":"D192*B146^4+D193*B146^3+D194*B146^2+D195*B146+D196","v":12.49565696},{"$f":"E192*B146^4+E193*B146^3+E194*B146^2+E195*B146+E196","v":1.4433189120000003},{"$f":"F192*I146^4+F193*I146^3+F194*I146^2+F195*I146+F196","v":-0.11659629510511216},{"$f":"G192*I146^4+G193*I146^3+G194*I146^2+G195*I146+G196","v":0.9745527524696993},{"$f":"IF(M146<0,\"-\",H192*L146^4+H193*L146^3+H194*L146^2+H195*L146+H196)","v":67.837784966064334},{"$f":"Simulator!$G$8+C146*B146*D146/1000","v":39.994788352},{"$f":"Simulator!$M$44","v":107},{"$f":"Simulator!K60","v":118},0.91916417789473126,{"$f":"M192*Q146^4+M193*Q146^3+M194*Q146^2+M195*Q146+M196","v":12.079502521474117},{"$f":"Simulator!$G$8+C146*M146*Q146/1000","v":33.065260250486446},{"$f":"O192*N146^4+O193*N146^3+O194*N146^2+O195*N146+O196","v":0.98652632774903415},{"$f":"P192*N146^4+P193*N146^3+P194*N146^2+P195*N146+P196","v":-6.6223659080974051E-2},{"$f":"Q192*R146^4+Q193*R146^3+Q194*R146^2+Q195*R146+Q196","v":66.76814907028313},0.90677966101694918,{"$f":"S192*H146^4+S193*H146^3+S194*H146^2+S195*H146+S196","v":12.095672182266075}]
["3030 1W 6V",{"$f":"Simulator!$M$14","v":120},12,{"$f":"D197*B147^4+D198*B147^3+D199*B147^2+D200*B147+D201","v":6.112076128},{"$f":"E197*B147^4+E198*B147^3+E199*B147^2+E200*B147+E201","v":0.81867108736000005},{"$f":"F197*I147^4+F198*I147^3+F199*I147^2+F200*I147+F201","v":-2.3400435624316498E-2},{"$f":"G197*I147^4+G198*I147^3+G199*I147^2+G200*I147+G201","v":0.98313361471090777},{"$f":"IF(M147<0,\"-\",H197*L147^4+H198*L147^3+H199*L147^2+H200*L147+H201)","v":128.85262711657049},{"$f":"Simulator!$G$8+C147*B147*D147/1000","v":33.801389624320002},{"$f":"Simulator!$M$44","v":107},{"$f":"Simulator!K62","v":125},0.8715409610254512,{"$f":"M197*Q147^4+M198*Q147^3+M199*Q147^2+M200*Q147+M201","v":6.1419470927187403},{"$f":"Simulator!$G$8+C147*M147*Q147/1000","v":34.308639738302169},{"$f":"O197*N147^4+O198*N147^3+O199*N147^2+O200*N147+O201","v":0.98216841006856892},{"$f":"P197*N147^4+P198*N147^3+P199*N147^2+P200*N147+P201","v":-2.4766407371069055E-2},{"$f":"Q197*R147^4+Q198*R147^3+Q199*R147^2+Q200*R147+Q201","v":126.2987073124516},0.85599999999999998,{"$f":"S197*H147^4+S198*H147^3+S199*H147^2+S200*H147+S201","v":6.153940441503158}]
["5050 1W 24V",{"$f":"Simulator!$M$14","v":120},3.1,{"$f":"D202*B148^4+D203*B148^3+D204*B148^2+D205*B148+D206","v":23.615006963200003},{"$f":"E202*B148^4+E203*B148^3+E204*B148^2+E205*B148+E206","v":2.5139397926399996},{"$f":"F202*I148^4+F203*I148^3+F204*I148^2+F205*I148+F206","v":-0.15645751333382574},{"$f":"G202*I148^4+G203*I148^3+G204*I148^2+G205*I148+G206","v":0.98804338982683193},{"$f":"IF(M148<0,\"-\",H202*L148^4+H203*L148^3+H204*L148^2+H205*L148+H206)","v":29.355517085014391},{"$f":"Simulator!$G$8+C148*B148*D148/1000","v":33.7847825903104},{"$f":"Simulator!$M$44","v":107},{"$f":"Simulator!K64","v":163},0.65798901816528244,{"$f":"M202*Q148^4+M203*Q148^3+M204*Q148^2+M205*Q148+M206","v":21.586947196697071},{"$f":"Simulator!$G$8+C148*M148*Q148/1000","v":26.959758968012729},{"$f":"O202*N148^4+O203*N148^3+O204*N148^2+O205*N148+O206","v":0.9976484404281003},{"$f":"P202*N148^4+P203*N148^3+P204*N148^2+P205*N148+P206","v":-4.0959419109585893E-2},{"$f":"Q202*R148^4+Q203*R148^3+Q204*R148^2+Q205*R148+Q206","v":29.285304054428682},0.65644171779141103,{"$f":"S202*H148^4+S203*H148^3+S204*H148^2+S205*H148+S206","v":21.588849764801228}]
["5050 3W 9V",{"$f":"Simulator!$M$14","v":120},3.3,{"$f":"D207*B149^4+D208*B149^3+D209*B149^2+D210*B149+D211","v":8.4831817548800004},{"$f":"E207*B149^4+E208*B149^3+E209*B149^2+E210*B149+E211","v":0.40852453984511999},{"$f":"F207*I149^4+F208*I149^3+F209*I149^2+F210*I149+F211","v":-1.7954395136606183E-2},{"$f":"G207*I149^4+G208*I149^3+G209*I149^2+G210*I149+G211","v":0.99432635219931753},{"$f":"IF(M149<0,\"-\",H207*L149^4+H208*L149^3+H209*L149^2+H210*L149+H211)","v":79.823509276836461},{"$f":"Simulator!$G$8+C149*B149*D149/1000","v":28.359339974932482},{"$f":"Simulator!$M$44","v":107},{"$f":"Simulator!K65","v":389},0.27611120036749459,{"$f":"M207*Q149^4+M208*Q149^3+M209*Q149^2+M210*Q149+M211","v":8.2718457510482253},{"$f":"Simulator!$G$8+C149*M149*Q149/1000","v":27.170443087681349},{"$f":"O207*N149^4+O208*N149^3+O209*N149^2+O210*N149+O211","v":0.99620829211594442},{"$f":"P207*N149^4+P208*N149^3+P209*N149^2+P210*N149+P211","v":-1.1689768090292818E-2},{"$f":"Q207*R149^4+Q208*R149^3+Q209*R149^2+Q210*R149+Q211","v":79.511882397802182},0.27506426735218509,{"$f":"S207*H149^4+S208*H149^3+S209*H149^2+S210*H149+S211","v":8.273606951903087}]
["5050 3W 18V",{"$f":"Simulator!$M$14","v":120},3.3,{"$f":"D212*B150^4+D213*B150^3+D214*B150^2+D215*B150+D216","v":17.978013184000002},{"$f":"E212*B150^4+E213*B150^3+E214*B150^2+E215*B150+E216","v":0.77589762750720004},{"$f":"F212*I150^4+F213*I150^3+F214*I150^2+F215*I150+F216","v":-0.14551866469897634},{"$f":"G212*I150^4+G213*I150^3+G214*I150^2+G215*I150+G216","v":0.98808138281205626},{"$f":"IF(M150<0,\"-\",H212*L150^4+H213*L150^3+H214*L150^2+H215*L150+H216)","v":39.910335594062587},{"$f":"Simulator!$G$8+C150*B150*D150/1000","v":32.119293220864002},{"$f":"Simulator!$M$44","v":107},{"$f":"Simulator!K66","v":389},0.27611116429203009,{"$f":"M212*Q150^4+M213*Q150^3+M214*Q150^2+M215*Q150+M216","v":16.543642574927397},{"$f":"Simulator!$G$8+C150*M150*Q150/1000","v":27.170359792048156},{"$f":"O212*N150^4+O213*N150^3+O214*N150^2+O215*N150+O216","v":0.99620842227611717},{"$f":"P212*N150^4+P213*N150^3+P214*N150^2+P215*N150+P216","v":-4.3668901523200021E-2},{"$f":"Q212*R150^4+Q213*R150^3+Q214*R150^2+Q215*R150+Q216","v":39.754533047388747},0.27506426735218509,{"$f":"S212*H150^4+S213*H150^3+S214*H150^2+S215*H150+S216","v":16.547164672246037}]
["5050 5W 9V",{"$f":"Simulator!$M$14","v":120},1.9,{"$f":"D217*B151^4+D218*B151^3+D219*B151^2+D220*B151+D221","v":8.2171264663040002},{"$f":"E217*B151^4+E218*B151^3+E219*B151^2+E220*B151+E221","v":0.26684336151680005},{"$f":"F217*I151^4+F218*I151^3+F219*I151^2+F220*I151+F221","v":-8.6077493880360179E-3},{"$f":"G217*I151^4+G218*I151^3+G219*I151^2+G220*I151+G221","v":0.9967104939073187},{"$f":"IF(M151<0,\"-\",H217*L151^4+H218*L151^3+H219*L151^2+H220*L151+H221)","v":82.625095480984783},{"$f":"Simulator!$G$8+C151*B151*D151/1000","v":26.873504834317313},{"$f":"Simulator!$M$44","v":107},{"$f":"Simulator!K67","v":579},0.18521914133999162,{"$f":"M217*Q151^4+M218*Q151^3+M219*Q151^2+M220*Q151+M221","v":8.0706620059642393},{"$f":"Simulator!$G$8+C151*M151*Q151/1000","v":26.2641037407219},{"$f":"O217*N151^4+O218*N151^3+O219*N151^2+O220*N151+O221","v":0.99774451147761578},{"$f":"P217*N151^4+P218*N151^3+P219*N151^2+P220*N151+P221","v":-5.2071824506823849E-3},{"$f":"Q217*R151^4+Q218*R151^3+Q219*R151^2+Q220*R151+Q221","v":82.436578038209646},0.1848013816925734,{"$f":"S217*H151^4+S218*H151^3+S219*H151^2+S220*H151+S221","v":8.0714334144695652}]
["5050 5W 36V",{"$f":"Simulator!$M$14","v":120},1.9,{"$f":"D222*B152^4+D223*B152^3+D224*B152^2+D225*B152+D226","v":36.977502463999997},{"$f":"E222*B152^4+E223*B152^3+E224*B152^2+E225*B152+E226","v":0.9651633166400001},{"$f":"F222*I152^4+F223*I152^3+F224*I152^2+F225*I152+F226","v":-0.17423334770106491},{"$f":"G222*I152^4+G223*I152^3+G224*I152^2+G225*I152+G226","v":0.98509187733371895},{"$f":"IF(M152<0,\"-\",H222*L152^4+H223*L152^3+H224*L152^2+H225*L152+H226)","v":20.655816150270436},{"$f":"Simulator!$G$8+C152*B152*D152/1000","v":33.430870561791998},{"$f":"Simulator!$M$44","v":107},{"$f":"Simulator!K68","v":579},0.18521913215059876,{"$f":"M222*Q152^4+M223*Q152^3+M224*Q152^2+M225*Q152+M226","v":32.282613606569292},{"$f":"Simulator!$G$8+C152*M152*Q152/1000","v":26.264074447930589},{"$f":"O222*N152^4+O223*N152^3+O224*N152^2+O225*N152+O226","v":0.99774456097933928},{"$f":"P222*N152^4+P223*N152^3+P224*N152^2+P225*N152+P226","v":-2.0821962082924639E-2},{"$f":"Q222*R152^4+Q223*R152^3+Q224*R152^2+Q225*R152+Q226","v":20.608688909894092},0.1848013816925734,{"$f":"S222*H152^4+S223*H152^3+S224*H152^2+S225*H152+S226","v":32.285699117313833}]
["5050 5W 9V Gen2",{"$f":"Simulator!$M$14","v":120},1.9,{"$f":"D227*B153^4+D228*B153^3+D229*B153^2+D230*B153+D231","v":8.0852480678400003},{"$f":"E227*B153^4+E228*B153^3+E229*B153^2+E230*B153+E231","v":0.25547428931839999},{"$f":"F227*I153^4+F228*I153^3+F229*I153^2+F230*I153+F231","v":-8.9762477102101335E-3},{"$f":"G227*I153^4+G228*I153^3+G229*I153^2+G230*I153+G231","v":0.99715557163064661},{"$f":"IF(M153<0,\"-\",H227*L153^4+H228*L153^3+H229*L153^2+H230*L153+H231)","v":81.198715149358904},{"$f":"Simulator!$G$8+C153*B153*D153/1000","v":26.84343655946752},{"$f":"Simulator!$M$44","v":107},{"$f":"Simulator!K69","v":615},0.17432809864875246,{"$f":"M227*Q153^4+M228*Q153^3+M229*Q153^2+M230*Q153+M231","v":7.9699814158813096},{"$f":"Simulator!$G$8+C153*M153*Q153/1000","v":26.227056876068989},{"$f":"O227*N153^4+O228*N153^3+O229*N153^2+O230*N153+O231","v":0.99802465113757755},{"$f":"P227*N153^4+P228*N153^3+P229*N153^2+P230*N153+P231","v":-5.4803421580881528E-3},{"$f":"Q227*R153^4+Q228*R153^3+Q229*R153^2+Q230*R153+Q231","v":81.031482353330972},0.17398373983739837,{"$f":"S227*H153^4+S228*H153^3+S229*H153^2+S230*H153+S231","v":7.9704981126061396}]
["5050 5W 36V Gen2",{"$f":"Simulator!$M$14","v":120},1.9,{"$f":"D232*B154^4+D233*B154^3+D234*B154^2+D235*B154+D236","v":35.337405631999999},{"$f":"E232*B154^4+E233*B154^3+E234*B154^2+E235*B154+E236","v":0.96412882505600006},{"$f":"F232*I154^4+F233*I154^3+F234*I154^2+F235*I154+F236","v":-0.17139766394528611},{"$f":"G232*I154^4+G233*I154^3+G234*I154^2+G235*I154+G236","v":0.98796865690422486},{"$f":"IF(M154<0,\"-\",H232*L154^4+H233*L154^3+H234*L154^2+H235*L154+H236)","v":20.299617626299707},{"$f":"Simulator!$G$8+C154*B154*D154/1000","v":33.056928484095998},{"$f":"Simulator!$M$44","v":107},{"$f":"Simulator!K70","v":615},0.17432725690692016,{"$f":"M232*Q154^4+M233*Q154^3+M234*Q154^2+M235*Q154+M236","v":31.790632705742851},{"$f":"Simulator!$G$8+C154*M154*Q154/1000","v":26.223622474937109},{"$f":"O232*N154^4+O233*N154^3+O234*N154^2+O235*N154+O236","v":0.99802947011490462},{"$f":"P232*N154^4+P233*N154^3+P234*N154^2+P235*N154+P236","v":-2.1782205678736899E-2},{"$f":"Q232*R154^4+Q233*R154^3+Q234*R154^2+Q235*R154+Q236","v":20.257911658295818},0.17398373983739837,{"$f":"S232*H154^4+S233*H154^3+S234*H154^2+S235*H154+S236","v":31.792688662277865}]
["2835 1W 18V ",{"$f":"Simulator!$M$14","v":120},28,{"$f":"D237*B155^4+D238*B155^3+D239*B155^2+D240*B155+D241","v":19.900726079999998},{"$f":"E237*B155^4+E238*B155^3+E239*B155^2+E240*B155+E241","v":1.8151909319999999},{"$f":"F237*I155^4+F238*I155^3+F239*I155^2+F240*I155+F241","v":-0.80139593544605414},{"$f":"G237*I155^4+G238*I155^3+G239*I155^2+G240*I155+G241","v":0.86527000395690612},{"$f":"IF(M155<0,\"-\",H237*L155^4+H238*L155^3+H239*L155^2+H240*L155+H241)","v":45.692209951849726},{"$f":"Simulator!$G$8+C155*B155*D155/1000","v":91.866439628799995},{"$f":"Simulator!$M$44","v":107},{"$f":"Simulator!K61","v":120},{"$f":"J155/K155/O155","v":0.92786041710174283},{"$f":"M237*Q155^4+M238*Q155^3+M239*Q155^2+M240*Q155+M241","v":18.375622677039765},{"$f":"Simulator!$G$8+C155*M155*Q155/1000","v":47.418621105126135},{"$f":"O237*N155^4+O238*N155^3+O239*N155^2+O240*N155+O241","v":0.96099224649745207},{"$f":"P237*N155^4+P238*N155^3+P239*N155^2+P240*N155+P241","v":-0.32346747148547783},{"$f":"Q237*R155^4+Q238*R155^3+Q239*R155^2+Q240*R155+Q241","v":43.572131053235921},{"$f":"J155/K155","v":0.89166666666666672},{"$f":"S237*H155^4+S238*H155^3+S239*H155^2+S240*H155+S241","v":18.454212248284982}]
["2835 0.2W 3V L",{"$f":"Simulator!$M$14","v":120},33,{"$f":"D242*B156^4+D243*B156^3+D244*B156^2+D245*B156+D246","v":3.1811716415999998},{"$f":"E242*B156^4+E243*B156^3+E244*B156^2+E245*B156+E246","v":1.7641958824000001},{"$f":"F242*I156^4+F243*I156^3+F244*I156^2+F245*I156+F246","v":-2.4754209839542698E-2},{"$f":"G242*I156^4+G243*I156^3+G244*I156^2+G245*I156+G246","v":0.97728077236085242},{"$f":"IF(M156<0,\"-\",H242*L156^4+H243*L156^3+H244*L156^2+H245*L156+H246)","v":"-"},{"$f":"Simulator!$G$8+C156*B156*D156/1000","v":37.597439700735997},{"$f":"Simulator!$M$44","v":107},{"$f":"Simulator!K48","v":24},1.0647108379699408E-3,{"$f":"M242*Q156^4+M243*Q156^3+M244*Q156^2+M245*Q156+M246","v":-49.072343637165922},{"$f":"Simulator!$G$8+C156*M156*Q156/1000","v":-1098.6624707009792},{"$f":"O242*N156^4+O243*N156^3+O244*N156^2+O245*N156+O246","v":4187.3654088408948},{"$f":"P242*N156^4+P243*N156^3+P244*N156^2+P245*N156+P246","v":908.36162212618308},{"$f":"Q242*R156^4+Q243*R156^3+Q244*R156^2+Q245*R156+Q246","v":693.88122466278423},4.458333333333333,{"$f":"S242*H156^4+S243*H156^3+S244*H156^2+S245*H156+S246","v":{"$error":"#VALUE!"}}]
["2835 1W 9V L",{"$f":"Simulator!$M$14","v":120},13.96,{"$f":"D247*B157^4+D248*B157^3+D249*B157^2+D250*B157+D251","v":9.4564407680000002},{"$f":"E247*B157^4+E248*B157^3+E249*B157^2+E250*B157+E251","v":1.1519256599999996},{"$f":"F247*I157^4+F248*I157^3+F249*I157^2+F250*I157+F251","v":-7.138365295980173E-2},{"$f":"G247*I157^4+G248*I157^3+G249*I157^2+G250*I157+G251","v":0.96922287405917751},{"$f":"IF(M157<0,\"-\",H247*L157^4+H248*L157^3+H249*L157^2+H250*L157+H251)","v":94.193228650330582},{"$f":"Simulator!$G$8+C157*B157*D157/1000","v":40.841429574553601},{"$f":"Simulator!$M$44","v":107},{"$f":"Simulator!K54","v":115},0.95204018268430801,{"$f":"M247*Q157^4+M248*Q157^3+M249*Q157^2+M250*Q157+M251","v":9.1820284342854066},{"$f":"Simulator!$G$8+C157*M157*Q157/1000","v":36.735442925659882},{"$f":"O247*N157^4+O248*N157^3+O249*N157^2+O250*N157+O251","v":0.97730620989683936},{"$f":"P247*N157^4+P248*N157^3+P249*N157^2+P250*N157+P251","v":-5.4754395126760891E-2},{"$f":"Q247*R157^4+Q248*R157^3+Q249*R157^2+Q250*R157+Q251","v":91.553601697142582},0.93043478260869561,{"$f":"S247*H157^4+S248*H157^3+S249*H157^2+S250*H157+S251","v":9.2082641870115314}]
["2836 1W 9V Gen3",{"$f":"Simulator!$M$14","v":120},8.66,{"$f":"D252*B158^4+D253*B158^3+D254*B158^2+D255*B158+D256","v":9.6684311679999997},{"$f":"E252*B158^4+E253*B158^3+E254*B158^2+E255*B158+E256","v":1.1557049736},{"$f":"F252*I158^4+F253*I158^3+F254*I158^2+F255*I158+F256","v":3.288244148599815E-2},{"$f":"G252*I158^4+G253*I158^3+G254*I158^2+G255*I158+G256","v":0.97941264686656182},{"$f":"IF(M158<0,\"-\",H252*L158^4+H253*L158^3+H254*L158^2+H255*L158+H256)","v":84.394917249449705},{"$f":"Simulator!$G$8+C158*B158*D158/1000","v":35.047433669785597},{"$f":"Simulator!$M$44","v":107},{"$f":"Simulator!K56","v":125},0.86788647061170088,{"$f":"M252*Q158^4+M253*Q158^3+M254*Q158^2+M255*Q158+M256","v":9.2092463937605427},{"$f":"Simulator!$G$8+C158*M158*Q158/1000","v":31.622715141574147},{"$f":"O252*N158^4+O253*N158^3+O254*N158^2+O255*N158+O256","v":0.98630411809124863},{"$f":"P252*N158^4+P253*N158^3+P254*N158^2+P255*N158+P256","v":3.7214782721485831E-2},{"$f":"Q252*R158^4+Q253*R158^3+Q254*R158^2+Q255*R158+Q256","v":83.041290696420546},0.85599999999999998,{"$f":"S252*H158^4+S253*H158^3+S254*H158^2+S255*H158+S256","v":9.2268449117960643}]
["2837 0.5W 3V Gen1",{"$f":"Simulator!$M$14","v":120},20,{"$f":"D257*B159^4+D258*B159^3+D259*B159^2+D260*B159+D261","v":3.1863470272000001},{"$f":"E257*B159^4+E258*B159^3+E259*B159^2+E260*B159+E261","v":0.82890156976000007},{"$f":"F257*I159^4+F258*I159^3+F259*I159^2+F260*I159+F261","v":-9.3003995620639796E-3},{"$f":"G257*I159^4+G258*I159^3+G259*I159^2+G260*I159+G261","v":0.98202555472767461},{"$f":"IF(M159<0,\"-\",H257*L159^4+H258*L159^3+H259*L159^2+H260*L159+H261)","v":330.82073974643362},{"$f":"Simulator!$G$8+C159*B159*D159/1000","v":32.647232865280003},{"$f":"Simulator!$M$44","v":107},{"$f":"Simulator!K50","v":62},1.7863142649629367,{"$f":"M257*Q159^4+M258*Q159^3+M259*Q159^2+M260*Q159+M261","v":2.4328205062870811},{"$f":"Simulator!$G$8+C159*M159*Q159/1000","v":40.250614277472124},{"$f":"O257*N159^4+O258*N159^3+O259*N159^2+O260*N159+O261","v":0.96612700545651808},{"$f":"P257*N159^4+P258*N159^3+P259*N159^2+P260*N159+P261","v":-1.8451302823933535E-2},{"$f":"Q257*R159^4+Q258*R159^3+Q259*R159^2+Q260*R159+Q261","v":313.43484318017539},1.7258064516129032,{"$f":"S257*H159^4+S258*H159^3+S259*H159^2+S260*H159+S261","v":1.9509457610241454}]
["2838 0.5W 3V Gen2",{"$f":"Simulator!$M$14","v":120},12,{"$f":"D262*B160^4+D263*B160^3+D264*B160^2+D265*B160+D266","v":3.0751868671999998},{"$f":"E262*B160^4+E263*B160^3+E264*B160^2+E265*B160+E266","v":0.82404114064000011},{"$f":"F262*I160^4+F263*I160^3+F264*I160^2+F265*I160+F266","v":-5.7744910444580411E-3},{"$f":"G262*I160^4+G263*I160^3+G264*I160^2+G265*I160+G266","v":0.99267400850591891},{"$f":"IF(M160<0,\"-\",H262*L160^4+H263*L160^3+H264*L160^2+H265*L160+H266)","v":316.68126097063282},{"$f":"Simulator!$G$8+C160*B160*D160/1000","v":29.428269088768001},{"$f":"Simulator!$M$44","v":107},{"$f":"Simulator!K51","v":63},1.7332300796126419,{"$f":"M262*Q160^4+M263*Q160^3+M264*Q160^2+M265*Q160+M266","v":3.1135539564484342},{"$f":"Simulator!$G$8+C160*M160*Q160/1000","v":36.448315700991728},{"$f":"O262*N160^4+O263*N160^3+O264*N160^2+O265*N160+O266","v":0.97991185266775149},{"$f":"P262*N160^4+P263*N160^3+P264*N160^2+P265*N160+P266","v":-1.2822313612725803E-2},{"$f":"Q262*R160^4+Q263*R160^3+Q264*R160^2+Q265*R160+Q266","v":306.41071963442556},1.6984126984126984,{"$f":"S262*H160^4+S263*H160^3+S264*H160^2+S265*H160+S266","v":3.0090604537551755}]
["2835 0.6W 6V ",{"$f":"Simulator!$M$14","v":120},16.93,{"$f":"D267*B161^4+D268*B161^3+D269*B161^2+D270*B161+D271","v":6.355633536},{"$f":"E267*B161^4+E268*B161^3+E269*B161^2+E270*B161+E271","v":1.1556285656},{"$f":"F272*I161^4+F273*I161^3+F274*I161^2+F275*I161+F276","v":-1.3821581508255611E-2},{"$f":"G267*I161^4+G268*I161^3+G269*I161^2+G270*I161+G271","v":0.97440344001415335},{"$f":"IF(M161<0,\"-\",H267*L161^4+H268*L161^3+H269*L161^2+H270*L161+H271)","v":168.76192693859332},{"$f":"Simulator!$G$8+C161*B161*D161/1000","v":37.912105091737601},{"$f":"Simulator!$M$44","v":107},{"$f":"Simulator!K53","v":75},1.478527405583429,{"$f":"M267*Q161^4+M268*Q161^3+M269*Q161^2+M270*Q161+M271","v":6.4973549645933231},{"$f":"Simulator!$G$8+C161*M161*Q161/1000","v":42.613204833535733},{"$f":"O267*N161^4+O268*N161^3+O269*N161^2+O270*N161+O271","v":0.96492405976316831},{"$f":"P267*N161^4+P268*N161^3+P269*N161^2+P270*N161+P271","v":-0.1093670051789592},{"$f":"Q267*R161^4+Q268*R161^3+Q269*R161^2+Q270*R161+Q271","v":160.11972435599804},1.4266666666666667,{"$f":"S267*H161^4+S268*H161^3+S269*H161^2+S270*H161+S271","v":6.4812107973680577}]
["2835 0.5W 3 Gen3",{"$f":"Simulator!$M$14","v":120},24,{"$f":"D272*B162^4+D273*B162^3+D274*B162^2+D275*B162+D276","v":3.0076447935999999},{"$f":"E272*B162^4+E273*B162^3+E274*B162^2+E275*B162+E276","v":0.81870127539199999},{"$f":"F272*I162^4+F273*I162^3+F274*I162^2+F275*I162+F276","v":-9.4734631009860959E-3},{"$f":"G272*I162^4+G273*I162^3+G274*I162^2+G275*I162+G276","v":0.98672653312166858},{"$f":"IF(M162<0,\"-\",H272*L162^4+H273*L162^3+H274*L162^2+H275*L162+H276)","v":254.91066079559437},{"$f":"Simulator!$G$8+C162*B162*D162/1000","v":33.662017005568003},{"$f":"Simulator!$M$44","v":107},{"$f":"Simulator!K52","v":70},{"$f":"J162/K162/O162","v":1.5769731906611797},{"$f":"M272*Q162^4+M273*Q162^3+M274*Q162^2+M275*Q162+M276","v":3.284089237802438},{"$f":"Simulator!$G$8+C162*M162*Q162/1000","v":44.36697921677797},{"$f":"O272*N162^4+O273*N162^3+O274*N162^2+O275*N162+O276","v":0.96930717505130337},{"$f":"P272*N162^4+P273*N162^3+P274*N162^2+P275*N162+P276","v":-2.0075855907895845E-2},{"$f":"Q272*R162^4+Q273*R162^3+Q274*R162^2+Q275*R162+Q276","v":245.7172777393003},1.5285714285714285,{"$f":"S272*H162^4+S273*H162^3+S274*H162^2+S275*H162+S276","v":3.2935927691499933}]
["2835 1W 9V CRI90(99N)",{"$f":"Simulator!$M$14","v":120},16,{"$f":"D277*B163^4+D278*B163^3+D279*B163^2+D280*B163+D281","v":9.3690591360000006},{"$f":"E277*B163^4+E278*B163^3+E279*B163^2+E280*B163+E281","v":1.1545772828800001},{"$f":"F277*I163^4+F278*I163^3+F279*I163^2+F280*I163+F281","v":-8.3384878570183008E-2},{"$f":"G277*I163^4+G278*I163^3+G279*I163^2+G280*I163+G281","v":0.97049822791404883},{"$f":"IF(M163<0,\"-\",H277*L163^4+H278*L163^3+H279*L163^2+H280*L163+H281)","v":{"$error":"#VALUE!"}},{"$f":"Simulator!$G$8+C163*B163*D163/1000","v":42.988593541119997},{"$f":"Simulator!$M$44","v":107},{"$f":"Simulator!K57","v":"-"},{"$f":"J163/K163/O163","v":{"$error":"#VALUE!"}},{"$f":"M277*Q163^4+M278*Q163^3+M279*Q163^2+M280*Q163+M281","v":{"$error":"#VALUE!"}},{"$f":"Simulator!$G$8+C163*M163*Q163/1000","v":{"$error":"#VALUE!"}},{"$f":"O277*N163^4+O278*N163^3+O279*N163^2+O280*N163+O281","v":{"$error":"#VALUE!"}},{"$f":"P277*N163^4+P278*N163^3+P279*N163^2+P280*N163+P281","v":{"$error":"#VALUE!"}},{"$f":"Q277*R163^4+Q278*R163^3+Q279*R163^2+Q280*R163+Q281","v":{"$error":"#VALUE!"}},{"$error":"#VALUE!"},{"$f":"S277*H163^4+S278*H163^3+S279*H163^2+S280*H163+S281","v":{"$error":"#VALUE!"}}]
["2836 1W 9V CRI90(9BN)",{"$f":"Simulator!$M$14","v":120},14,{"$f":"D282*B164^4+D283*B164^3+D284*B164^2+D285*B164+D286","v":9.3918520960000009},{"$f":"E282*B164^4+E283*B164^3+E284*B164^2+E285*B164+E286","v":1.1399136063999999},{"$f":"F282*I164^4+F283*I164^3+F284*I164^2+F285*I164+F286","v":-7.801853513378354E-2},{"$f":"G282*I164^4+G283*I164^3+G284*I164^2+G285*I164+G286","v":0.98033856938247488},{"$f":"IF(M164<0,\"-\",H282*L164^4+H283*L164^3+H284*L164^2+H285*L164+H286)","v":{"$error":"#VALUE!"}},{"$f":"Simulator!$G$8+C164*B164*D164/1000","v":40.778311521280003},{"$f":"Simulator!$M$44","v":107},{"$f":"Simulator!K58","v":"-"},{"$f":"J164/K164/O164","v":{"$error":"#VALUE!"}},{"$f":"M282*Q164^4+M283*Q164^3+M284*Q164^2+M285*Q164+M286","v":{"$error":"#VALUE!"}},{"$f":"Simulator!$G$8+C164*M164*Q164/1000","v":{"$error":"#VALUE!"}},{"$f":"O282*N164^4+O283*N164^3+O284*N164^2+O285*N164+O286","v":{"$error":"#VALUE!"}},{"$f":"P282*N164^4+P283*N164^3+P284*N164^2+P285*N164+P286","v":{"$error":"#VALUE!"}},{"$f":"Q282*R164^4+Q283*R164^3+Q284*R164^2+Q285*R164+Q286","v":{"$error":"#VALUE!"}},{"$f":"J164/K164","v":{"$error":"#VALUE!"}},{"$f":"S282*H164^4+S283*H164^3+S284*H164^2+S285*H164+S286","v":{"$error":"#VALUE!"}}]
["2837 1W 9V CRI90(9CN)",{"$f":"Simulator!$M$14","v":120},12,{"$f":"D287*B165^4+D288*B165^3+D289*B165^2+D290*B165+D291","v":9.6708692159999998},{"$f":"E287*B165^4+E288*B165^3+E289*B165^2+E290*B165+E291","v":1.1563286192},{"$f":"F287*I165^4+F288*I165^3+F289*I165^2+F290*I165+F291","v":-4.285168691103021E-2},{"$f":"G287*I165^4+G288*I165^3+G289*I165^2+G290*I165+G291","v":0.96958728610465827},{"$f":"IF(M165<0,\"-\",H287*L165^4+H288*L165^3+H289*L165^2+H290*L165+H291)","v":{"$error":"#VALUE!"}},{"$f":"Simulator!$G$8+C165*B165*D165/1000","v":38.92605167104},{"$f":"Simulator!$M$44","v":107},{"$f":"Simulator!K59","v":"-"},{"$f":"J165/K165/O165","v":{"$error":"#VALUE!"}},{"$f":"M287*Q165^4+M288*Q165^3+M289*Q165^2+M290*Q165+M291","v":{"$error":"#VALUE!"}},{"$f":"Simulator!$G$8+C165*M165*Q165/1000","v":{"$error":"#VALUE!"}},{"$f":"O287*N165^4+O288*N165^3+O289*N165^2+O290*N165+O291","v":{"$error":"#VALUE!"}},{"$f":"P287*N165^4+P288*N165^3+P289*N165^2+P290*N165+P291","v":{"$error":"#VALUE!"}},{"$f":"Q287*R165^4+Q288*R165^3+Q289*R165^2+Q290*R165+Q291","v":{"$error":"#VALUE!"}},{"$f":"J165/K165","v":{"$error":"#VALUE!"}},{"$f":"S287*H165^4+S288*H165^3+S289*H165^2+S290*H165+S291","v":{"$error":"#VALUE!"}}]
["3030 1W 6V(S)",{"$f":"Simulator!$M$14","v":120},12,{"$f":"D292*B166^4+D293*B166^3+D294*B166^2+D295*B166+D296","v":5.8649989631999997},{"$f":"E292*B166^4+E293*B166^3+E294*B166^2+E295*B166+E296","v":0.81826033824000011},{"$f":"F292*I166^4+F293*I166^3+F294*I166^2+F295*I166+F296","v":-1.5170492441516373E-2},{"$f":"G292*I166^4+G293*I166^3+G294*I166^2+G295*I166+G296","v":0.98730858766990437},{"$f":"IF(M166<0,\"-\",H292*L166^4+H293*L166^3+H294*L166^2+H295*L166+H296)","v":119.42242793609996},{"$f":"Simulator!$G$8+C166*B166*D166/1000","v":33.445598507008},{"$f":"Simulator!$M$44","v":107},{"$f":"Simulator!K63","v":133},{"$f":"J166/K166/O166","v":0.81463806497894309},{"$f":"M292*Q166^4+M293*Q166^3+M294*Q166^2+M295*Q166+M296","v":5.8539225805049107},{"$f":"Simulator!$G$8+C166*M166*Q166/1000","v":33.274416506712086},{"$f":"O292*N166^4+O293*N166^3+O294*N166^2+O295*N166+O296","v":0.98756897422450285},{"$f":"P292*N166^4+P293*N166^3+P294*N166^2+P295*N166+P296","v":-1.4868444084237022E-2},{"$f":"Q292*R166^4+Q293*R166^3+Q294*R166^2+Q295*R166+Q296","v":117.79019954739479},{"$f":"J166/K166","v":0.80451127819548873},{"$f":"S292*H166^4+S293*H166^3+S294*H166^2+S295*H166+S296","v":5.8621070831161441}]
[]
[]
[]
[]
[]
["2835 0.2W 3V",null,null,-3.8921999999999998E-10,-2.3266E-10,6.0763999999999998E-10,-1.3897000000000001E-9,0.91463000000000005,null,null,null,null,-3.8921999999999998E-10,null,-1.3897000000000001E-9,6.0763999999999998E-10,0.91463000000000005,null,-3.8921999999999998E-10]
[null,null,null,2.0415000000000001E-7,1.1075999999999999E-7,-1.9618E-7,3.5039E-7,-2.9762,null,null,null,null,2.0415000000000001E-7,null,3.5039E-7,-1.9618E-7,-2.9762,null,2.0415000000000001E-7]
[null,null,null,-4.2085000000000001E-5,-4.0880999999999997E-5,2.6359E-5,-3.4298999999999998E-5,10.689,null,null,null,null,-4.2085000000000001E-5,null,-3.4298999999999998E-5,2.6359E-5,10.689,null,-4.2085000000000001E-5]
[null,null,null,7.4580000000000002E-3,1.8832000000000002E-2,-2.8172000000000002E-3,-1.5458E-4,50.927999999999997,null,null,null,null,7.4580000000000002E-3,null,-1.5458E-4,-2.8172000000000002E-3,50.927999999999997,null,7.4580000000000002E-3]
[null,null,null,2.6286,-3.6630999999999999E-3,5.6785000000000002E-2,1.0204,0.49708999999999998,null,null,null,null,2.6286,null,1.0204,5.6785000000000002E-2,0.49708999999999998,null,2.6286]
["2835 0.2W 3V Gen2",null,null,-7.0466000000000003E-10,-1.2261E-10,0,3.4956999999999998E-9,0.12338,null,null,null,null,-7.0466000000000003E-10,null,3.4956999999999998E-9,0,0.12338,null,-7.0466000000000003E-10]
[null,null,null,2.7959999999999999E-7,5.2391000000000002E-8,0,-9.4962E-7,-0.44947999999999999,null,null,null,null,2.7959999999999999E-7,null,-9.4962E-7,0,-0.44947999999999999,null,2.7959999999999999E-7]
[null,null,null,-4.3129E-5,-2.048E-5,5.9523999999999998E-8,8.5649000000000006E-5,4.0022000000000002,null,null,null,null,-4.3129E-5,null,8.5649000000000006E-5,5.9523999999999998E-8,4.0022000000000002,null,-4.3129E-5]
[null,null,null,5.8884999999999996E-3,1.7867999999999998E-2,-1.0526999999999999E-3,-4.4437000000000001E-3,55.847999999999999,null,null,null,null,5.8884999999999996E-3,null,-4.4437000000000001E-3,-1.0526999999999999E-3,55.847999999999999,null,5.8884999999999996E-3]
[null,null,null,2.5508999999999999,-7.4714999999999998E-3,2.6395999999999999E-2,1.071,0.43947000000000003,null,null,null,null,2.5508999999999999,null,1.071,2.6395999999999999E-2,0.43947000000000003,null,2.5508999999999999]
["2835 0.5W 3V",null,null,-9.1291999999999999E-10,-8.8284E-11,4.3403E-10,1.1249999999999999E-9,6.9314999999999998,null,null,null,null,-9.1291999999999999E-10,null,1.1249999999999999E-9,4.3403E-10,6.9314999999999998,null,-9.1291999999999999E-10]
[null,null,null,3.6068999999999998E-7,3.9261999999999998E-8,-1.7188E-7,-3.0633999999999998E-7,-8.2331000000000003,null,null,null,null,3.6068999999999998E-7,null,-3.0633999999999998E-7,-1.7188E-7,-8.2331000000000003,null,3.6068999999999998E-7]
[null,null,null,-5.4236E-5,-1.4406999999999999E-5,2.5256E-5,2.4190999999999999E-5,30.651,null,null,null,null,-5.4236E-5,null,2.4190999999999999E-5,2.5256E-5,30.651,null,-5.4236E-5]
[null,null,null,7.3585999999999999E-3,8.2590000000000007E-3,-2.2663000000000002E-3,-2.6813000000000002E-3,120.3,null,null,null,null,7.3585999999999999E-3,null,-2.6813000000000002E-3,-2.2663000000000002E-3,120.3,null,7.3585999999999999E-3]
[null,null,null,2.5905999999999998,-2.5251000000000002E-3,4.3388000000000003E-2,1.0563,0.35477999999999998,null,null,null,null,2.5905999999999998,null,1.0563,4.3388000000000003E-2,0.35477999999999998,null,2.5905999999999998]
["2835 1W 9V Gen2",null,null,-4.1640999999999997E-9,-3.2577E-10,-5.6614999999999999E-9,2.7881999999999999E-9,3.4950000000000001,null,null,null,null,-4.1640999999999997E-9,null,2.7881999999999999E-9,-5.6614999999999999E-9,3.4950000000000001,null,-4.1640999999999997E-9]
[null,null,null,1.3918E-6,1.1543E-7,1.5301E-6,-7.2493999999999998E-7,-6.6367000000000003,null,null,null,null,1.3918E-6,null,-7.2493999999999998E-7,1.5301E-6,-6.6367000000000003,null,1.3918E-6]
[null,null,null,-1.8196E-4,-2.8787999999999999E-5,-1.305E-4,6.3626000000000004E-5,20.914000000000001,null,null,null,null,-1.8196E-4,null,6.3626000000000004E-5,-1.305E-4,20.914000000000001,null,-1.8196E-4]
[null,null,null,2.4660999999999999E-2,1.2118E-2,8.9716999999999998E-4,-3.9937999999999996E-3,81.584999999999994,null,null,null,null,2.4660999999999999E-2,null,-3.9937999999999996E-3,8.9716999999999998E-4,81.584999999999994,null,2.4660999999999999E-2]
[null,null,null,7.8791000000000002,{"$f":"-0.0067306","v":-6.7305999999999998E-3},3.7435999999999997E-2,1.0703,0.64151999999999998,null,null,null,null,7.8791000000000002,null,1.0703,3.7435999999999997E-2,0.64151999999999998,null,7.8791000000000002]
["2835 1W 12V",null,null,-2.5354E-8,-1.8028E-9,6.0846999999999999E-9,0,3.1587999999999998,null,null,null,null,-2.5354E-8,null,0,6.0846999999999999E-9,3.1587999999999998,null,-2.5354E-8]
[null,null,null,5.9923000000000002E-6,4.6513999999999999E-7,-1.6863000000000001E-6,0,-7.4316000000000004,null,null,null,null,5.9923000000000002E-6,null,0,-1.6863000000000001E-6,-7.4316000000000004,null,5.9923000000000002E-6]
[null,null,null,-5.4642999999999998E-4,-6.7945000000000001E-5,1.8883999999999999E-4,-1.8602E-6,19.806000000000001,null,null,null,null,-5.4642999999999998E-4,null,-1.8602E-6,1.8883999999999999E-4,19.806000000000001,null,-5.4642999999999998E-4]
[null,null,null,3.8157999999999997E-2,1.6622000000000001E-2,-1.5492000000000001E-2,-1.5920000000000001E-3,59.171999999999997,null,null,null,null,3.8157999999999997E-2,null,-1.5920000000000001E-3,-1.5492000000000001E-2,59.171999999999997,null,3.8157999999999997E-2]
[null,null,null,10.688000000000001,{"$f":"- 0.0028464","v":-2.8463999999999998E-3},0.29325000000000001,1.0411999999999999,0.23205999999999999,null,null,null,null,10.688000000000001,null,1.0411999999999999,0.29325000000000001,0.23205999999999999,null,10.688000000000001]
["3030 1W 6V",null,null,-6.9275000000000001E-11,-7.1848999999999994E-11,0,0,16.928999999999998,null,null,null,null,-6.9275000000000001E-11,null,0,0,16.928999999999998,null,-6.9275000000000001E-11]
[null,null,null,5.8839000000000002E-8,4.3581999999999999E-8,7.3678000000000006E-8,-1.1908E-8,-54.195999999999998,null,null,null,null,5.8839000000000002E-8,null,-1.1908E-8,7.3678000000000006E-8,-54.195999999999998,null,5.8839000000000002E-8]
[null,null,null,-2.0806999999999999E-5,-1.4005000000000001E-5,-1.0538E-5,2.0601E-6,80.484999999999999,null,null,null,null,-2.0806999999999999E-5,null,2.0601E-6,-1.0538E-5,80.484999999999999,null,-2.0806999999999999E-5]
[null,null,null,7.7073999999999997E-3,8.0984000000000004E-3,-2.2315E-3,-2.0016999999999999E-3,102.96,null,null,null,null,7.7073999999999997E-3,null,-2.0016999999999999E-3,-2.2315E-3,102.96,null,7.7073999999999997E-3]
[null,null,null,5.3994999999999997,-1.1875999999999999E-2,6.1221999999999999E-2,1.0488999999999999,4.0944000000000003,null,null,null,null,5.3994999999999997,null,1.0488999999999999,6.1221999999999999E-2,4.0944000000000003,null,5.3994999999999997]
["5050 1W 24V",null,null,-6.7062999999999999E-10,5.7323999999999998E-11,1.4969E-8,4.1991E-10,-7.8612000000000005E-3,null,null,null,null,-6.7062999999999999E-10,null,4.1991E-10,1.4969E-8,-7.8612000000000005E-3,null,-6.7062999999999999E-10]
[null,null,null,3.7609999999999999E-7,-2.0928999999999998E-8,-4.8295000000000001E-6,-1.0386E-7,0.24468999999999999,null,null,null,null,3.7609999999999999E-7,null,-1.0386E-7,-4.8295000000000001E-6,0.24468999999999999,null,3.7609999999999999E-7]
[null,null,null,-1.0338E-4,-1.4773000000000001E-5,5.8480999999999995E-4,2.9575000000000001E-6,1.0145999999999999,null,null,null,null,-1.0338E-4,null,2.9575000000000001E-6,5.8480999999999995E-4,1.0145999999999999,null,-1.0338E-4]
[null,null,null,3.2257000000000001E-2,2.2942000000000001E-2,-4.0724000000000003E-2,-1.346E-3,43.735999999999997,null,null,null,null,3.2257000000000001E-2,null,-1.346E-3,-4.0724000000000003E-2,43.735999999999997,null,3.2257000000000001E-2]
[null,null,null,20.722000000000001,-2.0904000000000001E-3,0.71862000000000004,1.0336000000000001,7.0206000000000005E-2,null,null,null,null,20.722000000000001,null,1.0336000000000001,0.71862000000000004,7.0206000000000005E-2,null,20.722000000000001]
["5050 3W 9V",null,null,-4.0317000000000003E-11,-2.9857999999999999E-14,9.1990999999999998E-10,-1.7808999999999999E-9,0.24306,null,null,null,null,-4.0317000000000003E-11,null,-1.7808999999999999E-9,9.1990999999999998E-10,0.24306,null,-4.0317000000000003E-11]
[null,null,null,4.8995999999999997E-8,6.1290000000000002E-10,-3.3467999999999998E-7,4.7023E-7,7.1188000000000002,null,null,null,null,4.8995999999999997E-8,null,4.7023E-7,-3.3467999999999998E-7,7.1188000000000002,null,4.8995999999999997E-8]
[null,null,null,-2.2317999999999999E-5,-1.7298999999999999E-6,5.6223E-5,-4.7840999999999998E-5,35.859000000000002,null,null,null,null,-2.2317999999999999E-5,null,-4.7840999999999998E-5,5.6223E-5,35.859000000000002,null,-2.2317999999999999E-5]
[null,null,null,8.3563000000000005E-3,3.6232E-3,-7.6959999999999997E-3,1.3856E-4,276.25,null,null,null,null,8.3563000000000005E-3,null,1.3856E-4,-7.6959999999999997E-3,276.25,null,8.3563000000000005E-3]
[null,null,null,7.7255000000000003,-2.4017999999999999E-3,0.16211999999999999,1.0193000000000001,0.66273000000000004,null,null,null,null,7.7255000000000003,null,1.0193000000000001,0.16211999999999999,0.66273000000000004,null,7.7255000000000003]
["5050 3W 18V",null,null,-1.2900999999999999E-9,-4.7773000000000003E-13,-1.4436000000000001E-9,-1.7808999999999999E-9,0.12153,null,null,null,null,-1.2900999999999999E-9,null,-1.7808999999999999E-9,-1.4436000000000001E-9,0.12153,null,-1.2900999999999999E-9]
[null,null,null,7.8393999999999996E-7,4.9032000000000002E-9,-1.7084000000000001E-7,4.7023E-7,3.5594000000000001,null,null,null,null,7.8393999999999996E-7,null,4.7023E-7,-1.7084000000000001E-7,3.5594000000000001,null,7.8393999999999996E-7]
[null,null,null,-1.7855E-4,-6.9195999999999998E-6,1.4077999999999999E-4,-4.7840999999999998E-5,17.928999999999998,null,null,null,null,-1.7855E-4,null,-4.7840999999999998E-5,1.4077999999999999E-4,17.928999999999998,null,-1.7855E-4]
[null,null,null,3.3425000000000003E-2,7.2464000000000001E-3,-2.8323999999999998E-2,1.3856E-4,138.12,null,null,null,null,3.3425000000000003E-2,null,1.3856E-4,-2.8323999999999998E-2,138.12,null,3.3425000000000003E-2]
[null,null,null,15.451000000000001,-2.4017999999999999E-3,0.62619000000000002,1.0193000000000001,0.33137,null,null,null,null,15.451000000000001,null,1.0193000000000001,0.62619000000000002,0.33137,null,15.451000000000001]
["5050 5W 9V",null,null,-5.0610999999999999E-12,-1.8036999999999999E-13,6.6887999999999997E-10,-8.3898000000000003E-10,6.4302000000000001,null,null,null,null,-5.0610999999999999E-12,null,-8.3898000000000003E-10,6.6887999999999997E-10,6.4302000000000001,null,-5.0610999999999999E-12]
[null,null,null,1.0236999999999999E-8,4.6443000000000002E-10,-3.2313000000000001E-7,2.0893000000000001E-7,-9.1516000000000002,null,null,null,null,1.0236999999999999E-8,null,2.0893000000000001E-7,-3.2313000000000001E-7,-9.1516000000000002,null,1.0236999999999999E-8]
[null,null,null,-7.8014999999999998E-6,-8.7762999999999995E-7,5.9475000000000002E-5,-2.4355999999999999E-5,77.793000000000006,null,null,null,null,-7.8014999999999998E-6,null,-2.4355999999999999E-5,5.9475000000000002E-5,77.793000000000006,null,-7.8014999999999998E-6]
[null,null,null,5.1818999999999997E-3,2.3524000000000002E-3,-8.1063999999999997E-3,-7.8207999999999999E-4,423.25,null,null,null,null,5.1818999999999997E-3,null,-7.8207999999999999E-4,-8.1063999999999997E-3,423.25,null,5.1818999999999997E-3]
[null,null,null,7.6909999999999998,-3.5718999999999998E-3,0.17221,1.0317000000000001,1.6129,null,null,null,null,7.6909999999999998,null,1.0317000000000001,0.17221,1.6129,null,7.6909999999999998]
["5050 5W 36V",null,null,-5.1825999999999999E-9,-4.6176E-11,2.6755000000000001E-9,-8.3898000000000003E-10,{"$f":" 1.6075","v":1.6074999999999999},null,null,null,null,-5.1825999999999999E-9,null,-8.3898000000000003E-10,2.6755000000000001E-9,{"$f":" 1.6075","v":1.6074999999999999},null,-5.1825999999999999E-9]
[null,null,null,2.6208E-6,2.9723999999999999E-8,-1.2924999999999999E-6,2.0893000000000001E-7,-2.2879,null,null,null,null,2.6208E-6,null,2.0893000000000001E-7,-1.2924999999999999E-6,-2.2879,null,2.6208E-6]
[null,null,null,-4.9929E-4,-1.4042E-5,2.3790000000000001E-4,-2.4355999999999999E-5,19.448,null,null,null,null,-4.9929E-4,null,-2.4355999999999999E-5,2.3790000000000001E-4,19.448,null,-4.9929E-4]
[null,null,null,8.2909999999999998E-2,9.4096000000000006E-3,-3.2425000000000002E-2,-7.8207999999999999E-4,105.81,null,null,null,null,8.2909999999999998E-2,null,-7.8207999999999999E-4,-3.2425000000000002E-2,105.81,null,8.2909999999999998E-2]
[null,null,null,30.763999999999999,-3.5718999999999998E-3,0.68883000000000005,1.0317000000000001,0.40323999999999999,null,null,null,null,30.763999999999999,null,1.0317000000000001,0.68883000000000005,0.40323999999999999,null,30.763999999999999]
["5050 5W 9V Gen2",null,null,-2.0260000000000001E-12,4.8718999999999997E-13,-6.6140999999999999E-10,-1.0255E-9,-17.907,null,null,null,null,-2.0260000000000001E-12,null,-1.0255E-9,-6.6140999999999999E-10,-17.907,null,-2.0260000000000001E-12]
[null,null,null,4.9788999999999998E-9,-1.0223000000000001E-9,-8.6118999999999992E-9,2.5745000000000002E-7,88.840999999999994,null,null,null,null,4.9788999999999998E-9,null,2.5745000000000002E-7,-8.6118999999999992E-9,88.840999999999994,null,4.9788999999999998E-9]
[null,null,null,-4.6918999999999999E-6,2.8224999999999998E-7,3.3399999999999999E-5,-2.7127E-5,-70.483000000000004,null,null,null,null,-4.6918999999999999E-6,null,-2.7127E-5,3.3399999999999999E-5,-70.483000000000004,null,-4.6918999999999999E-6]
[null,null,null,3.7569000000000001E-3,2.0446000000000001E-3,-7.3765999999999997E-3,-4.3752999999999999E-4,502.48,null,null,null,null,3.7569000000000001E-3,null,-4.3752999999999999E-4,-7.3765999999999997E-3,502.48,null,3.7569000000000001E-3]
[null,null,null,7.6938000000000004,7.7234000000000001E-3,0.16547999999999999,1.024,-4.7098000000000004,null,null,null,null,7.6938000000000004,null,1.024,0.16547999999999999,-4.7098000000000004,null,7.6938000000000004]
["5050 5W 36V Gen2",null,null,-2.0688000000000001E-9,-8.4003999999999996E-12,-2.6381999999999998E-9,-1.0255E-9,-4.4767999999999999,null,null,null,null,-2.0688000000000001E-9,null,-1.0255E-9,-2.6381999999999998E-9,-4.4767999999999999,null,-2.0688000000000001E-9]
[null,null,null,1.271E-6,4.4070000000000002E-9,-3.4351000000000001E-8,2.5745000000000002E-7,22.21,null,null,null,null,1.271E-6,null,2.5745000000000002E-7,-3.4351000000000001E-8,22.21,null,1.271E-6]
[null,null,null,-2.9943999999999999E-4,-7.1821999999999996E-6,1.3322E-4,-2.7127E-5,-17.620999999999999,null,null,null,null,-2.9943999999999999E-4,null,-2.7127E-5,1.3322E-4,-17.620999999999999,null,-2.9943999999999999E-4]
[null,null,null,5.9942000000000002E-2,8.8471000000000001E-3,-2.9423000000000001E-2,-4.3752999999999999E-4,125.62,null,null,null,null,5.9942000000000002E-2,null,-4.3752999999999999E-4,-2.9423000000000001E-2,125.62,null,5.9942000000000002E-2]
[null,null,null,30.689,2.7115999999999999E-5,0.66005000000000003,1.024,-1.1774,null,null,null,null,30.689,null,1.024,0.66005000000000003,-1.1774,null,30.689]
["2835 1W 18V",null,null,-3.7247000000000003E-8,-2.3988E-9,1.4756999999999999E-8,4.3163000000000001E-9,2.891,null,null,null,null,-3.7247000000000003E-8,null,4.3163000000000001E-9,1.4756999999999999E-8,2.891,null,-3.7247000000000003E-8]
[null,null,null,9.2129999999999997E-6,5.8505000000000001E-7,-4.0103999999999998E-6,-1.0301999999999999E-6,-5.3287000000000004,null,null,null,null,9.2129999999999997E-6,null,-1.0301999999999999E-6,-4.0103999999999998E-6,-5.3287000000000004,null,9.2129999999999997E-6]
[null,null,null,-1.0003E-3,-1.1459999999999999E-4,4.3121000000000001E-4,8.0413000000000004E-5,13.46,null,null,null,null,-1.0003E-3,null,8.0413000000000004E-5,4.3121000000000001E-4,13.46,null,-1.0003E-3]
[null,null,null,8.4545999999999996E-2,2.4631E-2,-3.2448999999999999E-2,-4.2810000000000001E-3,38.606999999999999,null,null,null,null,8.4545999999999996E-2,null,-4.2810000000000001E-3,-3.2448999999999999E-2,38.606999999999999,null,8.4545999999999996E-2]
[null,null,null,15.962999999999999,-3.8403000000000001E-3,0.59862000000000004,1.0711999999999999,0.39612999999999998,null,null,null,null,15.962999999999999,null,1.0711999999999999,0.59862000000000004,0.39612999999999998,null,15.962999999999999]
["2835 0.2W 3V L",null,null,-5.0194000000000003E-10,-3.7165999999999999E-10,4.3403E-10,2.2659999999999998E-9,1.6501999999999999,null,null,null,null,-5.0194000000000003E-10,null,2.2659999999999998E-9,4.3403E-10,1.6501999999999999,null,-5.0194000000000003E-10]
[null,null,null,2.4858999999999998E-7,1.8215E-7,-1.7882000000000001E-7,-6.1332000000000004E-7,-5.5517000000000003,null,null,null,null,2.4858999999999998E-7,null,-6.1332000000000004E-7,-1.7882000000000001E-7,-5.5517000000000003,null,2.4858999999999998E-7]
[null,null,null,-4.9594E-5,-5.6232E-5,2.9110000000000001E-5,5.5736999999999998E-5,16.260999999999999,null,null,null,null,-4.9594E-5,null,5.5736999999999998E-5,2.9110000000000001E-5,16.260999999999999,null,-4.9594E-5]
[null,null,null,7.9162E-3,1.9470000000000001E-2,-3.3099000000000002E-3,-3.7512999999999999E-3,47.12,null,null,null,null,7.9162E-3,null,-3.7512999999999999E-3,-3.3099000000000002E-3,47.12,null,7.9162E-3]
[null,null,null,2.6198999999999999,-1.5109999999999999E-4,6.7177000000000001E-2,1.0676000000000001,0.59592000000000001,null,null,null,null,2.6198999999999999,null,1.0676000000000001,6.7177000000000001E-2,0.59592000000000001,null,2.6198999999999999]
["2835 1W 9V L",null,null,-2.8762000000000001E-9,-2.2025E-11,6.4236E-9,7.4314999999999996E-10,1.7573000000000001,null,null,null,null,-2.8762000000000001E-9,null,7.4314999999999996E-10,6.4236E-9,1.7573000000000001,null,-2.8762000000000001E-9]
[null,null,null,1.1087000000000001E-6,4.4343000000000002E-8,-1.6007E-6,-1.7959000000000001E-7,2.2006999999999999,null,null,null,null,1.1087000000000001E-6,null,-1.7959000000000001E-7,-1.6007E-6,2.2006999999999999,null,1.1087000000000001E-6]
[null,null,null,-1.7035999999999999E-4,-2.8670000000000002E-5,1.5756E-4,1.1157E-5,16.190899999999999,null,null,null,null,-1.7035999999999999E-4,null,1.1157E-5,1.5756E-4,16.190899999999999,null,-1.7035999999999999E-4]
[null,null,null,2.2110000000000001E-2,1.2437999999999999E-2,-1.0545000000000001E-2,-2.1968000000000001E-3,79.983999999999995,null,null,null,null,2.2110000000000001E-2,null,-2.1968000000000001E-3,-1.0545000000000001E-2,79.983999999999995,null,2.2110000000000001E-2]
[null,null,null,7.9370000000000003,1.5605999999999999E-4,0.18765000000000001,1.0505,2.7456000000000001E-2,null,null,null,null,7.9370000000000003,null,1.0505,0.18765000000000001,2.7456000000000001E-2,null,7.9370000000000003]
["2835 1W 9V Gen3",null,null,-4.7487000000000004E-9,-2.6498999999999998E-10,-2.6042000000000002E-9,-3.2733E-10,7.4382999999999999,null,null,null,null,-4.7487000000000004E-9,null,-3.2733E-10,-2.6042000000000002E-9,7.4382999999999999,null,-4.7487000000000004E-9]
[null,null,null,1.5771999999999999E-6,7.3049999999999996E-8,6.4931000000000004E-7,-8.0458000000000005E-9,-10.505000000000001,null,null,null,null,1.5771999999999999E-6,null,-8.0458000000000005E-9,6.4931000000000004E-7,-10.505000000000001,null,1.5771999999999999E-6]
[null,null,null,-2.0589999999999999E-4,-2.5242999999999999E-5,-4.5391E-5,7.9106000000000001E-6,21.608000000000001,null,null,null,null,-2.0589999999999999E-4,null,7.9106000000000001E-6,-4.5391E-5,21.608000000000001,null,-2.0589999999999999E-4]
[null,null,null,2.5458999999999999E-2,1.2101000000000001E-2,-1.8406999999999998E-5,-2.4642000000000002E-3,80.989999999999995,null,null,null,null,2.5458999999999999E-2,null,-2.4642000000000002E-3,-1.8406999999999998E-5,80.989999999999995,null,2.5458999999999999E-2]
[null,null,null,7.8376000000000001,-4.1979000000000001E-3,6.5258999999999998E-2,1.0569,0.47621999999999998,null,null,null,null,7.8376000000000001,null,1.0569,6.5258999999999998E-2,0.47621999999999998,null,7.8376000000000001]
["2835 0.5W 3V Gen1",null,null,-7.2098000000000003E-10,-7.1059000000000002E-11,-1.0417E-9,2.2294000000000002E-9,5.6818999999999997,null,null,null,null,-7.2098000000000003E-10,null,2.2294000000000002E-9,-1.0417E-9,5.6818999999999997,null,-7.2098000000000003E-10]
[null,null,null,2.9237999999999998E-7,3.1963E-8,2.4999999999999999E-7,-6.7859999999999995E-7,-5.9291999999999998,null,null,null,null,2.9237999999999998E-7,null,-6.7859999999999995E-7,2.4999999999999999E-7,-5.9291999999999998,null,2.9237999999999998E-7]
[null,null,null,-4.5828000000000002E-5,-1.2947E-5,-1.6926999999999999E-5,6.8790999999999999E-5,27.587,null,null,null,null,-4.5828000000000002E-5,null,6.8790999999999999E-5,-1.6926999999999999E-5,27.587,null,-4.5828000000000002E-5]
[null,null,null,7.2370000000000004E-3,8.1533000000000005E-3,-7.6563E-4,-4.8278000000000001E-3,122.19,null,null,null,null,7.2370000000000004E-3,null,-4.8278000000000001E-3,-7.6563E-4,122.19,null,7.2370000000000004E-3]
[null,null,null,2.6221000000000001,-3.5549000000000002E-3,2.6221000000000001E-2,1.0873999999999999,0.46657999999999999,null,null,null,null,2.6221000000000001,null,1.0873999999999999,2.6221000000000001E-2,0.46657999999999999,null,2.6221000000000001]
["2835 0.5W 3V Gen2",null,null,-4.5598000000000001E-10,-9.8050999999999996E-11,7.8124999999999996E-10,-3.3142E-9,11.532999999999999,null,null,null,null,-4.5598000000000001E-10,null,-3.3142E-9,7.8124999999999996E-10,11.532999999999999,null,-4.5598000000000001E-10]
[null,null,null,2.1215999999999999E-7,3.8507000000000002E-8,-3.8715000000000002E-7,7.9398000000000002E-7,-20.379000000000001,null,null,null,null,2.1215999999999999E-7,null,7.9398000000000002E-7,-3.8715000000000002E-7,-20.379000000000001,null,2.1215999999999999E-7]
[null,null,null,-3.6983999999999997E-5,-1.1877E-5,5.7043999999999998E-5,-6.8955000000000006E-5,34.331000000000003,null,null,null,null,-3.6983999999999997E-5,null,-6.8955000000000006E-5,5.7043999999999998E-5,34.331000000000003,null,-3.6983999999999997E-5]
[null,null,null,6.2557999999999997E-3,7.9298000000000007E-3,-3.6099000000000001E-3,6.0966000000000004E-4,124.11,null,null,null,null,6.2557999999999997E-3,null,6.0966000000000004E-4,-3.6099000000000001E-3,124.11,null,6.2557999999999997E-3]
[null,null,null,2.585,-2.7142999999999998E-3,6.0338000000000003E-2,1.0166999999999999,0.46564,null,null,null,null,2.585,null,1.0166999999999999,6.0338000000000003E-2,0.46564,null,2.585]
["2835 0.6W 6V",null,null,-3.6824E-9,-2.1949000000000001E-10,6.3367999999999999E-9,-1.0476E-9,6.3440000000000003,null,null,null,null,-3.6824E-9,null,-1.0476E-9,6.3367999999999999E-9,6.3440000000000003,null,-3.6824E-9]
[null,null,null,1.2865000000000001E-6,6.5179000000000004E-8,-1.8663E-6,2.2513999999999999E-7,-7.9372999999999996,null,null,null,null,1.2865000000000001E-6,null,2.2513999999999999E-7,-1.8663E-6,-7.9372999999999996,null,1.2865000000000001E-6]
[null,null,null,-1.9108999999999999E-4,-2.5287999999999999E-5,2.1576000000000001E-4,-1.7887999999999999E-5,19.97,null,null,null,null,-1.9108999999999999E-4,null,-1.7887999999999999E-5,2.1576000000000001E-4,19.97,null,-1.9108999999999999E-4]
[null,null,null,2.2131999999999999E-2,1.2154E-2,-1.5299999999999999E-2,-1.3977E-3,81.072000000000003,null,null,null,null,2.2131999999999999E-2,null,-1.3977E-3,-1.5299999999999999E-2,81.072000000000003,null,2.2131999999999999E-2]
[null,null,null,4.992,-5.8200999999999999E-3,0.27433999999999997,1.0429999999999999,0.57720000000000005,null,null,null,null,4.992,null,1.0429999999999999,0.27433999999999997,0.57720000000000005,null,4.992]
["2835 0.5W 3V Gen3",null,null,-2.4574000000000002E-10,3.9222199999999998E-11,-8.6806E-11,-1.2911E-9,-3.7393999999999998,null,null,null,null,-2.4574000000000002E-10,null,-1.2911E-9,-8.6806E-11,-3.7393999999999998,null,-2.4574000000000002E-10]
[null,null,null,1.3437999999999999E-7,-1.2185E-8,-8.6806E-9,2.7883000000000002E-7,12.694000000000001,null,null,null,null,1.3437999999999999E-7,null,2.7883000000000002E-7,-8.6806E-9,12.694000000000001,null,1.3437999999999999E-7]
[null,null,null,-2.7538E-5,-4.3803999999999996E-6,6.8445999999999997E-6,-2.4664E-5,6.2195999999999998,null,null,null,null,-2.7538E-5,null,-2.4664E-5,6.8445999999999997E-6,6.2195999999999998,null,-2.7538E-5]
[null,null,null,4.9795000000000004E-3,7.4710999999999996E-3,-1.4636E-3,-6.7148999999999996E-4,134.81,null,null,null,null,4.9795000000000004E-3,null,-6.7148999999999996E-4,-1.4636E-3,134.81,null,4.9795000000000004E-3]
[null,null,null,2.6254,-1.8304E-3,3.2481000000000003E-2,1.0283,0.19575999999999999,null,null,null,null,2.6254,null,1.0283,3.2481000000000003E-2,0.19575999999999999,null,2.6254]
["2835 1W 9V CRI90(99N)",null,null,-2.8024000000000002E-9,-2.6342000000000001E-11,1.2152999999999999E-9,2.4883999999999998E-9,0.75517000000000001,null,null,null,null,-2.8024000000000002E-9,null,2.4883999999999998E-9,1.2152999999999999E-9,0.75517000000000001,null,-2.8024000000000002E-9]
[null,null,null,1.0881E-6,4.6495E-8,-4.1319000000000001E-7,-6.1979999999999998E-7,3.3491,null,null,null,null,1.0881E-6,null,-6.1979999999999998E-7,-4.1319000000000001E-7,3.3491,null,1.0881E-6]
[null,null,null,-1.6888E-4,-2.7940999999999999E-5,6.2195999999999999E-5,4.9462999999999997E-5,15.111000000000001,null,null,null,null,-1.6888E-4,null,4.9462999999999997E-5,6.2195999999999999E-5,15.111000000000001,null,-1.6888E-4]
[null,null,null,2.1595E-2,1.2356000000000001E-2,-7.6027000000000004E-3,-3.2234E-3,80.786000000000001,null,null,null,null,2.1595E-2,null,-3.2234E-3,-7.6027000000000004E-3,80.786000000000001,null,2.1595E-2]
[null,null,null,7.9104000000000001,-6.734E-4,0.15717999999999999,1.0584,7.4275999999999995E-2,null,null,null,null,7.9104000000000001,null,1.0584,0.15717999999999999,7.4275999999999995E-2,null,7.9104000000000001]
["2836 1W 9V CRI90(9BN)",null,null,-1.9429E-9,5.0618999999999999E-10,2.2308999999999998E-9,2.2083999999999999E-9,-28.757999999999999,null,null,null,null,-1.9429E-9,null,2.2083999999999999E-9,2.2308999999999998E-9,-28.757999999999999,null,-1.9429E-9]
[null,null,null,8.1727999999999997E-7,-7.0133999999999998E-8,-7.0052000000000003E-7,-5.8647999999999999E-7,86.664000000000001,null,null,null,null,8.1727999999999997E-7,null,-5.8647999999999999E-7,-7.0052000000000003E-7,86.664000000000001,null,8.1727999999999997E-7]
[null,null,null,-1.3747E-4,-2.3235999999999999E-5,9.3739000000000005E-5,4.9654999999999998E-5,-55.311,null,null,null,null,-1.3747E-4,null,4.9654999999999998E-5,9.3739000000000005E-5,-55.311,null,-1.3747E-4]
[null,null,null,2.2047000000000001E-2,1.1882E-2,-9.1293999999999993E-3,-2.9052000000000001E-3,105.16,null,null,null,null,2.2047000000000001E-2,null,-2.9052000000000001E-3,-9.1293999999999993E-3,105.16,null,2.2047000000000001E-2]
[null,null,null,7.7164000000000001,6.4899999999999999E-2,0.17971999999999999,1.0499000000000001,-7.8173000000000004,null,null,null,null,7.7164000000000001,null,1.0499000000000001,0.17971999999999999,-7.8173000000000004,null,7.7164000000000001]
["2837 1W 9V CRI90(9CN)",null,null,-2.8544E-9,1.6347000000000001E-10,-2.6042000000000002E-9,2.9768999999999999E-9,1.0134000000000001,null,null,null,null,-2.8544E-9,null,2.9768999999999999E-9,-2.6042000000000002E-9,1.0134000000000001,null,-2.8544E-9]
[null,null,null,1.1052E-6,-3.3689999999999999E-8,6.4931000000000004E-7,-8.737E-7,5.0503999999999998,null,null,null,null,1.1052E-6,null,-8.737E-7,6.4931000000000004E-7,5.0503999999999998,null,1.1052E-6]
[null,null,null,-1.6762E-4,-1.6583999999999999E-5,-4.5391E-5,8.6978999999999995E-5,9.2195999999999998,null,null,null,null,-1.6762E-4,null,8.6978999999999995E-5,-4.5391E-5,9.2195999999999998,null,-1.6762E-4]
[null,null,null,2.4334999999999999E-2,1.1847E-2,-1.8407E-3,-5.4336000000000002E-3,84.626999999999995,null,null,null,null,2.4334999999999999E-2,null,-5.4336000000000002E-3,-1.8407E-3,84.626999999999995,null,2.4334999999999999E-2]
[null,null,null,7.8464999999999998,-2.1825999999999998E-3,6.5258999999999998E-2,1.0940000000000001,0.17460000000000001,null,null,null,null,7.8464999999999998,null,1.0940000000000001,6.5258999999999998E-2,0.17460000000000001,null,7.8464999999999998]
["3030 1W 6V(S)",null,null,-1.1263E-10,-4.3791E-11,-9.0587E-10,-3.0557999999999999E-10,4.4988999999999999,null,null,null,null,-1.1263E-10,null,-3.0557999999999999E-10,-9.0587E-10,4.4988999999999999,null,-1.1263E-10]
[null,null,null,7.8314999999999997E-8,2.7579999999999999E-8,1.9861E-7,4.5257E-8,-13.779,null,null,null,null,7.8314999999999997E-8,null,4.5257E-8,1.9861E-7,-13.779,null,7.8314999999999997E-8]
[null,null,null,-2.1721000000000001E-5,-1.0317E-5,-9.2814000000000006E-6,-4.7696E-6,33.143000000000001,null,null,null,null,-2.1721000000000001E-5,null,-4.7696E-6,-9.2814000000000006E-6,33.143000000000001,null,-2.1721000000000001E-5]
[null,null,null,7.6134000000000002E-3,7.7738E-3,-1.6738E-3,-1.3086E-3,125.06,null,null,null,null,7.6134000000000002E-3,null,-1.3086E-3,-1.6738E-3,125.06,null,7.6134000000000002E-3]
[null,null,null,5.1521999999999997,-4.6086E-3,4.4895999999999998E-2,1.0350999999999999,1.0167999999999999,null,null,null,null,5.1521999999999997,null,1.0350999999999999,4.4895999999999998E-2,1.0167999999999999,null,5.1521999999999997]