{"text_format":"1","workbook":"xlsx","n_sheets":3,"sheets":["User Guide","Simulator","Raw data"],"not_rendered":{"charts":0,"images":5,"macros":0,"external_links":1,"defined_names":3,"comments":0,"pivot_tables":0},"unopened":[],"bounds":{"document_bytes":16777216,"sheet_cells":100000,"rows_first":2000,"rows_last":500,"rows_between":2000,"halvings":0,"cell_chars":16384,"cell_head_chars":4096},"cells_cut":0,"cells_raw":0,"read":"whole","date_system":"1900"}

{"sheet":"User Guide","index":0,"n_rows":0,"n_cols":0,"rows_kept":0,"cut":false,"hidden":false,"merged":[]}

{"sheet":"Simulator","index":1,"n_rows":70,"n_cols":17,"rows_kept":70,"cut":false,"hidden":false,"merged":[[5,6,5,7],[7,6,7,7],[0,1,2,9]]}
[null,"Bridgelux SMD Products Simulator"]
[null,null,null,null,null,null,null,null,null,null,null,null,null,"Rev 6"]
[null,null,null,null,null,null,null,null,null,null,null,"Valid Until",null,"2019-06-30"]
[null,"Enter color and temperature values:",null,null,null,null,null,null,null,null,null,null,"Section 1"]
[]
[null,null,null,null,null,"Color Temperature and CRI:","2700K, 80 CRI"]
[]
[null,null,null,null,null,"Case Temperature (0-105℃):",25]
[]
[]
[]
[]
[null,"Lumen Output at Required Drive Current",null,null,null,null,null,null,null,null,null,null,"Section 2"]
[null,"Calculate lumens for selected drive current",null,null,null,null,null,null,null,null,"ENTER DRIVE CURRENT in mA (1-960mA):",null,120]
[null,"SMD 2835, 3030, 5050"]
[null,"Product","Part Number","Drive\nCurrent\n(mA)","Voltage\n(V)","Power\n(W)",{"$f":"\"Lumen DC @ Case = \"&G8&\" °C\"","v":"Lumen DC @ Case = 25 °C"},{"$f":"\"Efficacy DC @ Case = \"&G8&\" °C\"","v":"Efficacy DC @ Case = 25 °C"},"Max Drive\nCurrent\n(mA)","Typical\n Current\n (mA)","Typical Pulsed Lumens @ Case=25°C","Typical Pulsed Efficacy @ Case=25°C","Tj\n (°C)"]
[null,"2835 0.2W 3V",{"$f":"IFERROR(VLOOKUP($G$6,'Raw data'!$A$2:$N$28,2,0),\"\")","v":"BXEN-27E-11L-3AA-00-0-0"},{"$f":"IF(C17=\"-\",\"-\",IF($M$14>I17,\"-\",$M$14))","v":"-"},{"$f":"IF(D17=\"-\",\"-\",'Raw data'!D143+'Raw data'!F143)","v":"-"},{"$f":"IF(D17=\"-\",\"-\",D17*E17/1000)","v":"-"},{"$f":"IF(D17=\"-\",\"-\",Simulator!K17*'Raw data'!E143*'Raw data'!G143)","v":"-"},{"$f":"IF(D17=\"-\",\"-\",G17/F17)","v":"-"},{"$f":"IFERROR(VLOOKUP($G$6,'Raw data'!$A$30:$N$56,2,0),\"\")","v":100},{"$f":"IFERROR(VLOOKUP($G$6,'Raw data'!$A$58:$N$84,2,0),\"\")","v":60},{"$f":"IFERROR(VLOOKUP($G$6,'Raw data'!$A$86:$N$112,2,0),\"\")","v":26},{"$f":"IFERROR(VLOOKUP($G$6,'Raw data'!$A$114:$N$140,2,0),\"\")","v":144},{"$f":"IF(D17=\"-\",\"-\",'Raw data'!I143)","v":"-"}]
[null,"2835 0.2W 3V L",{"$f":"IFERROR(VLOOKUP($G$6,'Raw data'!$A$2:$P$28,16,0),\"\")","v":"BXEN-27E-11L-37A-00-0-0"},{"$f":"IF(C18=\"-\",\"-\",IF($M$14>I18,\"-\",$M$14))","v":"-"},{"$f":"IF(D18=\"-\",\"-\",'Raw data'!D156+'Raw data'!F156)","v":"-"},{"$f":"IF(D18=\"-\",\"-\",D18*E18/1000)","v":"-"},{"$f":"IF(D18=\"-\",\"-\",Simulator!K18*'Raw data'!E156*'Raw data'!G156)","v":"-"},{"$f":"IF(D18=\"-\",\"-\",G18/F18)","v":"-"},{"$f":"IFERROR(VLOOKUP($G$6,'Raw data'!$A$30:$P$56,16,0),\"\")","v":100},{"$f":"IFERROR(VLOOKUP($G$6,'Raw data'!$A$58:$P$84,16,0),\"\")","v":60},{"$f":"IFERROR(VLOOKUP($G$6,'Raw data'!$A$86:$P$112,16,0),\"\")","v":24},{"$f":"IFERROR(VLOOKUP($G$6,'Raw data'!$A$114:$P$140,16,0),\"\")","v":133},{"$f":"IF(D18=\"-\",\"-\",'Raw data'!I156)","v":"-"}]
[null,"2835 0.5W 3V",{"$f":"IFERROR(VLOOKUP($G$6,'Raw data'!$A$3:$N$28,4,0),\"\")","v":"BXEN-27E-11M-39A-00-0-0"},{"$f":"IF(C19=\"-\",\"-\",IF($M$14>I19,\"-\",$M$14))","v":120},{"$f":"IF(D19=\"-\",\"-\",'Raw data'!D144+'Raw data'!F144)","v":3.1210274268269549},{"$f":"IF(D19=\"-\",\"-\",D19*E19/1000)","v":0.37452329121923456},{"$f":"IF(D19=\"-\",\"-\",Simulator!K19*'Raw data'!E144*'Raw data'!G144)","v":49.401202158527802},{"$f":"IF(D19=\"-\",\"-\",G19/F19)","v":131.90421882095936},{"$f":"IFERROR(VLOOKUP($G$6,'Raw data'!$A$30:$N$56,4,0),\"\")","v":150},{"$f":"IFERROR(VLOOKUP($G$6,'Raw data'!$A$58:$N$84,4,0),\"\")","v":150},{"$f":"IFERROR(VLOOKUP($G$6,'Raw data'!$A$86:$N$112,4,0),\"\")","v":60},{"$f":"IFERROR(VLOOKUP($G$6,'Raw data'!$A$114:$N$140,4,0),\"\")","v":125},{"$f":"IF(D19=\"-\",\"-\",'Raw data'!I144)","v":29.502308073472001}]
[null,"2835 0.5W 3V Gen1",{"$f":"IFERROR(VLOOKUP($G$6,'Raw data'!$A$2:$S$28,19,0),\"\")","v":"BXEN-27E-11M-3A-00-0-0"},{"$f":"IF(C20=\"-\",\"-\",IF($M$14>I20,\"-\",$M$14))","v":120},{"$f":"IF(D20=\"-\",\"-\",'Raw data'!D159+'Raw data'!F159)","v":3.1770466276379361},{"$f":"IF(D20=\"-\",\"-\",D20*E20/1000)","v":0.38124559531655233},{"$f":"IF(D20=\"-\",\"-\",Simulator!K20*'Raw data'!E159*'Raw data'!G159)","v":50.468156479208673},{"$f":"IF(D20=\"-\",\"-\",G20/F20)","v":132.37702179169943},{"$f":"IFERROR(VLOOKUP($G$6,'Raw data'!$A$30:$S$56,19,0),\"\")","v":150},{"$f":"IFERROR(VLOOKUP($G$6,'Raw data'!$A$58:$S$84,19,0),\"\")","v":150},{"$f":"IFERROR(VLOOKUP($G$6,'Raw data'!$A$86:$S$112,19,0),\"\")","v":62},{"$f":"IFERROR(VLOOKUP($G$6,'Raw data'!$A$114:$S$140,19,0),\"\")","v":125},{"$f":"IF(D20=\"-\",\"-\",'Raw data'!I159)","v":32.647232865280003}]
[null,"2835 0.5W 3V Gen2",{"$f":"IFERROR(VLOOKUP($G$6,'Raw data'!$A$2:$T$28,20,0),\"\")","v":"BXEN-27E-11M-3AA-00-00-0"},{"$f":"IF(C21=\"-\",\"-\",IF($M$14>I21,\"-\",$M$14))","v":120},{"$f":"IF(D21=\"-\",\"-\",'Raw data'!D160+'Raw data'!F160)","v":3.0694123761555416},{"$f":"IF(D21=\"-\",\"-\",D21*E21/1000)","v":0.36832948513866498},{"$f":"IF(D21=\"-\",\"-\",Simulator!K21*'Raw data'!E160*'Raw data'!G160)","v":51.534266001932615},{"$f":"IF(D21=\"-\",\"-\",G21/F21)","v":139.91349615285759},{"$f":"IFERROR(VLOOKUP($G$6,'Raw data'!$A$30:$T$56,20,0),\"\")","v":150},{"$f":"IFERROR(VLOOKUP($G$6,'Raw data'!$A$58:$T$84,20,0),\"\")","v":150},{"$f":"IFERROR(VLOOKUP($G$6,'Raw data'!$A$86:$T$112,20,0),\"\")","v":63},{"$f":"IFERROR(VLOOKUP($G$6,'Raw data'!$A$114:$T$140,20,0),\"\")","v":131},{"$f":"IF(D21=\"-\",\"-\",'Raw data'!I160)","v":29.428269088768001}]
[null,"2835 0.5W 3V Gen3",{"$f":"IFERROR(VLOOKUP($G$6,'Raw data'!$A$2:$U$28,3,0),\"\")","v":"BXEN-27E-11M-3CA-00-0-0"},{"$f":"IF(C22=\"-\",\"-\",IF($M$14>I22,\"-\",$M$14))","v":120},{"$f":"IF(D22=\"-\",\"-\",'Raw data'!D162+'Raw data'!F162)","v":2.9981713304990136},{"$f":"IF(D22=\"-\",\"-\",D22*E22/1000)","v":0.35978055965988165},{"$f":"IF(D22=\"-\",\"-\",Simulator!K22*'Raw data'!E162*'Raw data'!G162)","v":56.54839897908856},{"$f":"IF(D22=\"-\",\"-\",G22/F22)","v":157.17469290877349},{"$f":"IFERROR(VLOOKUP($G$6,'Raw data'!$A$30:$T$56,3,0),\"\")","v":150},{"$f":"IFERROR(VLOOKUP($G$6,'Raw data'!$A$58:$T$84,3,0),\"\")","v":150},{"$f":"IFERROR(VLOOKUP($G$6,'Raw data'!$A$86:$T$112,3,0),\"\")","v":70},{"$f":"IFERROR(VLOOKUP($G$6,'Raw data'!$A$114:$T$140,3,0),\"\")","v":156},{"$f":"IF(D22=\"-\",\"-\",'Raw data'!I162)","v":33.662017005568003}]
[null,"2835 0.6W 6V ",{"$f":"IFERROR(VLOOKUP($G$6,'Raw data'!$A$2:$U$28,21,0),\"\")","v":"BXEN-27E-12M-6A-00-0-0"},{"$f":"IF(C23=\"-\",\"-\",IF($M$14>I23,\"-\",$M$14))","v":120},{"$f":"IF(D23=\"-\",\"-\",'Raw data'!D161+'Raw data'!F161)","v":6.3418119544917442},{"$f":"IF(D23=\"-\",\"-\",D23*E23/1000)","v":0.76101743453900927},{"$f":"IF(D23=\"-\",\"-\",Simulator!K23*'Raw data'!E161*'Raw data'!G161)","v":84.453633727444625},{"$f":"IF(D23=\"-\",\"-\",G23/F23)","v":110.97463723495757},{"$f":"IFERROR(VLOOKUP($G$6,'Raw data'!$A$30:$U$56,21,0),\"\")","v":120},{"$f":"IFERROR(VLOOKUP($G$6,'Raw data'!$A$58:$U$84,21,0),\"\")","v":100},{"$f":"IFERROR(VLOOKUP($G$6,'Raw data'!$A$86:$U$112,21,0),\"\")","v":75},{"$f":"IFERROR(VLOOKUP($G$6,'Raw data'!$A$114:$U$140,21,0),\"\")","v":117},{"$f":"IF(D23=\"-\",\"-\",'Raw data'!I161)","v":37.912105091737601}]
[null,"2835 1W 9V L",{"$f":"IFERROR(VLOOKUP($G$6,'Raw data'!$A$2:$Q$28,17,0),\"\")","v":"BXEN-27E-13H-98-00-0-0"},{"$f":"IF(C24=\"-\",\"-\",IF($M$14>I24,\"-\",$M$14))","v":120},{"$f":"IF(D24=\"-\",\"-\",'Raw data'!D157+'Raw data'!F157)","v":9.3850571150401993},{"$f":"IF(D24=\"-\",\"-\",D24*E24/1000)","v":1.1262068538048238},{"$f":"IF(D24=\"-\",\"-\",Simulator!K24*'Raw data'!E157*'Raw data'!G157)","v":128.39436037208716},{"$f":"IF(D24=\"-\",\"-\",G24/F24)","v":114.00601935453895},{"$f":"IFERROR(VLOOKUP($G$6,'Raw data'!$A$30:$Q$56,17,0),\"\")","v":120},{"$f":"IFERROR(VLOOKUP($G$6,'Raw data'!$A$58:$Q$84,17,0),\"\")","v":100},{"$f":"IFERROR(VLOOKUP($G$6,'Raw data'!$A$86:$Q$112,17,0),\"\")","v":115},{"$f":"IFERROR(VLOOKUP($G$6,'Raw data'!$A$114:$Q$140,17,0),\"\")","v":124},{"$f":"IF(D24=\"-\",\"-\",'Raw data'!I157)","v":40.841429574553601}]
[null,"2835 1W 9V Gen2",{"$f":"IFERROR(VLOOKUP($G$6,'Raw data'!$A$2:$N$28,5,0),\"\")","v":"BXEN-27E-13H-9B-00-0-0"},120,{"$f":"IF(D25=\"-\",\"-\",'Raw data'!D145+'Raw data'!F145)","v":9.7196728098188547},1.1663607371782625,{"$f":"IF(D25=\"-\",\"-\",Simulator!K25*'Raw data'!E145*'Raw data'!G145)","v":131.08852642713325},112.39106585863935,{"$f":"IFERROR(VLOOKUP($G$6,'Raw data'!$A$30:$N$56,5,0),\"\")","v":120},{"$f":"IFERROR(VLOOKUP($G$6,'Raw data'!$A$58:$N$84,5,0),\"\")","v":100},{"$f":"IFERROR(VLOOKUP($G$6,'Raw data'!$A$86:$N$112,5,0),\"\")","v":115},{"$f":"IFERROR(VLOOKUP($G$6,'Raw data'!$A$114:$N$140,5,0),\"\")","v":121},{"$f":"IF(D25=\"-\",\"-\",'Raw data'!I145)","v":36.711710348799997}]
[null,"2835 1W 9V Gen3",{"$f":"IFERROR(VLOOKUP($G$6,'Raw data'!$A$2:$R$28,18,0),\"\")","v":"BXEN-27E-13H-9C-00-0-0"},{"$f":"IF(C26=\"-\",\"-\",IF($M$14>I26,\"-\",$M$14))","v":120},{"$f":"IF(D26=\"-\",\"-\",'Raw data'!D158+'Raw data'!F158)","v":9.7013136094859984},{"$f":"IF(D26=\"-\",\"-\",D26*E26/1000)","v":1.1641576331383199},{"$f":"IF(D26=\"-\",\"-\",Simulator!K26*'Raw data'!E158*'Raw data'!G158)","v":141.48900839880326},{"$f":"IF(D26=\"-\",\"-\",G26/F26)","v":121.53767185065752},{"$f":"IFERROR(VLOOKUP($G$6,'Raw data'!$A$30:$R$56,18,0),\"\")","v":120},{"$f":"IFERROR(VLOOKUP($G$6,'Raw data'!$A$58:$R$84,18,0),\"\")","v":100},{"$f":"IFERROR(VLOOKUP($G$6,'Raw data'!$A$86:$R$112,18,0),\"\")","v":125},{"$f":"IFERROR(VLOOKUP($G$6,'Raw data'!$A$114:$R$140,18,0),\"\")","v":134},{"$f":"IF(D26=\"-\",\"-\",'Raw data'!I158)","v":35.047433669785597}]
[null,"2835 1W 9V CRI90(99N)",{"$f":"IFERROR(VLOOKUP($G$6,'Raw data'!$A$2:$V$28,22,0),\"\")","v":"-"},{"$f":"IF(C27=\"-\",\"-\",IF($M$14>I27,\"-\",$M$14))","v":"-"},{"$f":"IF(D27=\"-\",\"-\",'Raw data'!D163+'Raw data'!F163)","v":"-"},{"$f":"IF(D27=\"-\",\"-\",D27*E27/1000)","v":"-"},{"$f":"IF(D27=\"-\",\"-\",Simulator!K27*'Raw data'!E163*'Raw data'!G163)","v":"-"},{"$f":"IF(D27=\"-\",\"-\",G27/F27)","v":"-"},{"$f":"IFERROR(VLOOKUP($G$6,'Raw data'!$A$30:$V$56,22,0),\"\")","v":"-"},{"$f":"IFERROR(VLOOKUP($G$6,'Raw data'!$A$58:$V$84,22,0),\"\")","v":"-"},{"$f":"IFERROR(VLOOKUP($G$6,'Raw data'!$A$86:$V$112,22,0),\"\")","v":"-"},{"$f":"IFERROR(VLOOKUP($G$6,'Raw data'!$A$114:$V$140,22,0),\"\")","v":"-"},{"$f":"IF(D27=\"-\",\"-\",'Raw data'!I163)","v":"-"}]
[null,"2835 1W 9V CRI90(9BN)",{"$f":"IFERROR(VLOOKUP($G$6,'Raw data'!$A$2:$W$28,23,0),\"\")","v":"-"},{"$f":"IF(C28=\"-\",\"-\",IF($M$14>I28,\"-\",$M$14))","v":"-"},{"$f":"IF(D28=\"-\",\"-\",'Raw data'!D164+'Raw data'!F164)","v":"-"},{"$f":"IF(D28=\"-\",\"-\",D28*E28/1000)","v":"-"},{"$f":"IF(D28=\"-\",\"-\",Simulator!K28*'Raw data'!E164*'Raw data'!G164)","v":"-"},{"$f":"IF(D28=\"-\",\"-\",G28/F28)","v":"-"},{"$f":"IFERROR(VLOOKUP($G$6,'Raw data'!$A$30:$W$56,23,0),\"\")","v":"-"},{"$f":"IFERROR(VLOOKUP($G$6,'Raw data'!$A$58:$W$84,23,0),\"\")","v":"-"},{"$f":"IFERROR(VLOOKUP($G$6,'Raw data'!$A$86:$W$112,23,0),\"\")","v":"-"},{"$f":"IFERROR(VLOOKUP($G$6,'Raw data'!$A$114:$W$140,23,0),\"\")","v":"-"},{"$f":"IF(D28=\"-\",\"-\",'Raw data'!I164)","v":"-"}]
[null,"2835 1W 9V CRI90(9CN)",{"$f":"IFERROR(VLOOKUP($G$6,'Raw data'!$A$2:$X$28,24,0),\"\")","v":"-"},{"$f":"IF(C29=\"-\",\"-\",IF($M$14>I29,\"-\",$M$14))","v":"-"},{"$f":"IF(D29=\"-\",\"-\",'Raw data'!D165+'Raw data'!F165)","v":"-"},{"$f":"IF(D29=\"-\",\"-\",D29*E29/1000)","v":"-"},{"$f":"IF(D29=\"-\",\"-\",Simulator!K29*'Raw data'!E165*'Raw data'!G165)","v":"-"},{"$f":"IF(D29=\"-\",\"-\",G29/F29)","v":"-"},{"$f":"IFERROR(VLOOKUP($G$6,'Raw data'!$A$30:$X$56,24,0),\"\")","v":"-"},{"$f":"IFERROR(VLOOKUP($G$6,'Raw data'!$A$58:$X$84,24,0),\"\")","v":"-"},{"$f":"IFERROR(VLOOKUP($G$6,'Raw data'!$A$86:$X$112,24,0),\"\")","v":"-"},{"$f":"IFERROR(VLOOKUP($G$6,'Raw data'!$A$114:$X$140,24,0),\"\")","v":"-"},{"$f":"IF(D29=\"-\",\"-\",'Raw data'!I165)","v":"-"}]
[null,"2835 1W 12V Gen2",{"$f":"IFERROR(VLOOKUP($G$6,'Raw data'!$A$2:$N$28,6,0),\"\")","v":"BXEN-27E-14H-12B-00-0-0"},"-",{"$f":"IF(D30=\"-\",\"-\",'Raw data'!D146+'Raw data'!F146)","v":"-"},"-",{"$f":"IF(D30=\"-\",\"-\",Simulator!K30*'Raw data'!E146*'Raw data'!G146)","v":"-"},"-",{"$f":"IFERROR(VLOOKUP($G$6,'Raw data'!$A$30:$N$56,6,0),\"\")","v":90},{"$f":"IFERROR(VLOOKUP($G$6,'Raw data'!$A$58:$N$84,6,0),\"\")","v":75},{"$f":"IFERROR(VLOOKUP($G$6,'Raw data'!$A$86:$N$112,6,0),\"\")","v":118},{"$f":"IFERROR(VLOOKUP($G$6,'Raw data'!$A$114:$N$140,6,0),\"\")","v":129},{"$f":"IF(D30=\"-\",\"-\",'Raw data'!I146)","v":"-"}]
{"$rows_left_out":41}
{"sheet":"Raw data","index":2,"n_rows":296,"n_cols":25,"rows_kept":296,"cut":false,"hidden":true,"merged":[[296,0,300,0],[301,0,305,0],[306,0,310,0],[311,0,315,0],[316,0,320,0],[271,0,275,0],[276,0,280,0],[281,0,285,0],[286,0,290,0],[291,0,295,0],[171,0,175,0],[176,0,180,0],[181,0,185,0],[186,0,190,0],[191,0,195,0],[196,0,200,0],[201,0,205,0],[206,0,210,0],[211,0,215,0],[216,0,220,0],[261,0,265,0],[266,0,270,0],[221,0,225,0],[226,0,230,0],[231,0,235,0],[251,0,255,0],[256,0,260,0],[246,0,250,0],[241,0,245,0],[236,0,240,0]]}
["Color Temperature and CRI:","2835 0.2W 3V","2835 0.5W 3V Gen3","2835 0.5W 3V","2835 1W 9V Gen2","2835 1W 12V","3030 1W 6V","5050 1W 24V","5050 3W 9V","5050 3W 18V","5050 5W 9V","5050 5W 36V","5050 5W 9V Gen2","5050 5W 36V Gen2","2835 1W 18V","2835 0.2W 3V L","2835 1W 9V L","2835 1W 9V Gen3","2835 0.5W 3V Gen1","2835 0.5W 3V Gen2","2835 0.6W 6V ","2835 1W 9V CRI90","2835 1W 9V CRI90","2835 1W 9V CRI90","3030 1W 6V(S)"]
["2200K,80 CRI","-","-","-","-","-","-","-","-","-","-","-","-","-","-","-","-","-","-","-","-","-","-","-","BXEM-22E-12H-6A-00-0-0"]
["2700K, 70 CRI","-","-","-","-","-","BXEM-27C0000-0-000","BXEP-27C-181-24A-00-00-0 ","-","-","-","-","BXEP-27C-435-09B-00-00-0","BXEP-27C-1C5-36B-00-00-0","-","-","-","-","-","-","-","-","-","-","BXEM-27C-12H-6A-00-0-0"]
["2700K, 80 CRI","BXEN-27E-11L-3AA-00-0-0","BXEN-27E-11M-3CA-00-0-0","BXEN-27E-11M-39A-00-0-0","BXEN-27E-13H-9B-00-0-0","BXEN-27E-14H-12B-00-0-0","BXEM-27E0000-0-000","BXEP-27E-181-24A-00-00-0 ","BXEP-27E-233-09A-00-00-0","BXEP-27E-163-18A-00-00-0","BXEP-27E-435-09A-00-00-0","BXEP-27E-1C5-36A-00-00-0","BXEP-27E-435-09B-00-00-0","BXEP-27E-1C5-36B-00-00-0","BXEN-27E-11H-18A-00-0-0","BXEN-27E-11L-37A-00-0-0","BXEN-27E-13H-98-00-0-0","BXEN-27E-13H-9C-00-0-0","BXEN-27E-11M-3A-00-0-0","BXEN-27E-11M-3AA-00-00-0","BXEN-27E-12M-6A-00-0-0","-","-","-","BXEM-27E12H-6A-00-0-0"]
["2700K, 90 CRI","-","-","-","BXEN-27G-13H-9B-00-0-0","BXEN-27G-14H-12B-00-0-0","BXEM-27G0000-0-000","BXEP-27G-181-24A-00-00-0 ","-","-","-","-","BXEP-27G-435-09B-00-00-0","BXEP-27G-1C5-36B-00-00-0","BXEN-27G-11H-18A-00-0-0","-","-","BXEN-27G-13H-9C-00-0-0","BXEN-27G-11M-3A-00-0-0","-","-","BXEN-27G-13H-99N-00-0-0","BXEN-27G-13H-9BN-00-0-0","BXEN-27G-13H-9CN-00-0-0","BXEM-27G-12H-6A-00-0-0"]
["2700K, 94 CRI","-","-","-","-","-","-","BXEP-27H-181-24A-00-00-0 ","-","-","-","-","-","-","-","-","-","-","-","-","-","-","-","-","-"]
["3000K, 70 CRI","-","-","-","-","-","BXEM-30C0000-0-000","BXEP-30C-181-24A-00-00-0 ","-","-","-","-","BXEP-30C-435-09B-00-00-0","BXEP-30C-1C5-36B-00-00-0","-","-","-","-","-","-","-","-","-","-","BXEM-30C-12H-6A-00-0-0"]
["3000K, 80 CRI","BXEN-30E-11L-3AA-00-0-0","BXEN-30E-11M-3CA-00-0-0","BXEN-30E-11M-39A-00-0-0","BXEN-30E-13H-9B-00-0-0","BXEN-30E-14H-12B-00-0-0","BXEM-30E0000-0-000","BXEP-30E-181-24A-00-00-0 ","BXEP-30E-233-09A-00-00-0","BXEP-30E-163-18A-00-00-0","BXEP-30E-435-09A-00-00-0","BXEP-30E-1C5-36A-00-00-0","BXEP-30E-435-09B-00-00-0","BXEP-30E-1C5-36B-00-00-0","BXEN-30E-11H-18A-00-0-0","BXEN-30E-11L-37A-00-0-0","BXEN-30E-13H-98-00-0-0","BXEN-30E-13H-9C-00-0-0","BXEN-30E-11M-3A-00-0-0","BXEN-30E-11M-3AA-00-00-0","BXEN-30E-12M-6A-00-0-0","-","-","-","BXEM-30E-12H-6A-00-0-0"]
["3000K, 90 CRI","-","-","-","BXEN-30G-13H-9B-00-0-0","BXEN-30G-14H-12B-00-0-0","BXEM-30G0000-0-000","BXEP-30G-181-24A-00-00-0 ","-","-","-","-","BXEP-30G-435-09B-00-00-0","BXEP-30G-1C5-36B-00-00-0","BXEN-30G-11H-18A-00-0-0","-","-","BXEN-30G-13H-9C-00-0-0","BXEN-30G-11M-3A-00-0-0","-","-","BXEN-30G-13H-99N-00-0-0","BXEN-30G-13H-9BN-00-0-0","BXEN-30G-13H-9CN-00-0-0","BXEM-30G-12H-6A-00-0-0"]
["3500K, 70 CRI","-","-","-","-","-","BXEM-35C0000-0-000","BXEP-35C-181-24A-00-00-0 ","-","-","-","-","BXEP-35C-435-09B-00-00-0","BXEP-35C-1C5-36B-00-00-0","-","-","-","-","-","-","-","-","-","-","BXEM-35C-12H-6A-00-0-0"]
["3500K, 80 CRI","BXEN-35E-11L-3AA-00-0-0","BXEN-35E-11M-3CA-00-0-0","BXEN-35E-11M-39A-00-0-0","BXEN-35E-13H-9B-00-0-0","BXEN-35E-14H-12B-00-0-0","BXEM-35E0000-0-000","BXEP-35E-181-24A-00-00-0 ","BXEP-35E-233-09A-00-00-0","BXEP-35E-163-18A-00-00-0","BXEP-35E-435-09A-00-00-0","BXEP-35E-1C5-36A-00-00-0","BXEP-35E-435-09B-00-00-0","BXEP-35E-1C5-36B-00-00-0","BXEN-35E-11H-18A-00-0-0","BXEN-35E-11L-37A-00-0-0","BXEN-35E-13H-98-00-0-0","BXEN-35E-13H-9C-00-0-0","BXEN-35E-11M-3A-00-0-0","BXEN-35E-11M-3AA-00-00-0","BXEN-35E-12M-6A-00-0-0","-","-","-","BXEM-35E-12H-6A-00-0-0"]
["3500K, 90 CRI","-","-",null,"BXEN-35G-13H-9B-00-0-0","BXEN-35G-14H-12B-00-0-0","BXEM-35G0000-0-000","-","-","-","-","-","-","-","BXEN-35G-11H-18A-00-0-0","-","-","BXEN-35G-13H-9C-00-0-0","BXEN-35G-11M-3A-00-0-0","-","-","BXEN-35G-13H-99N-00-0-0","BXEN-35G-13H-9BN-00-0-0","BXEN-35G-13H-9CN-00-0-0","BXEM-35G-12H-6A-00-0-0"]
["4000K, 70 CRI","-","-","-","-","-","BXEM-40C0000-0-000","BXEP-40C-181-24A-00-00-0 ","-","-","-","-","BXEP-40C-435-09B-00-00-0","BXEP-40C-1C5-36B-00-00-0","-","-","-","-","-","-","-","-","-","-","BXEM-40C-12H-6A-00-0-0"]
["4000K, 80 CRI","BXEN-40E-11L-3AA-00-0-0","BXEN-40E-11M-3CA-00-0-0","BXEN-40E-11M-39A-00-0-0","BXEN-40E-13H-9B-00-0-0","BXEN-40E-14H-12B-00-0-0","BXEM-40E0000-0-000","BXEP-40E-181-24A-00-00-0 ","BXEP-40E-233-09A-00-00-0","BXEP-40E-163-18A-00-00-0","BXEP-40E-435-09A-00-00-0","BXEP-40E-1C5-36A-00-00-0","BXEP-40E-435-09B-00-00-0","BXEP-40E-1C5-36B-00-00-0","BXEN-40E-11H-18A-00-0-0","BXEN-40E-11L-37A-00-0-0","BXEN-40E-13H-98-00-0-0","BXEN-40E-13H-9C-00-0-0","BXEN-40E-11M-3A-00-0-0","BXEN-40E-11M-3AA-00-00-0","BXEN-40E-12M-6A-00-0-0","-","-","-","BXEM-40E-12H-6A-00-0-0"]
["4000K, 90 CRI","-","-","-","BXEN-40G-13H-9B-00-0-0","BXEN-40G-14H-12B-00-0-0","BXEM-40G0000-0-000","BXEP-40G-181-24A-00-00-0 ","-","-","-","-","BXEP-40G-435-09B-00-00-0","BXEP-40G-1C5-36B-00-00-0","BXEN-40G-11H-18A-00-0-0","-","-","BXEN-40G-13H-9C-00-0-0","BXEN-40G-11M-3A-00-0-0","-","-","BXEN-40G-13H-99N-00-0-0","BXEN-40G-13H-9BN-00-0-0","BXEN-40G-13H-9CN-00-0-0","BXEM-40G-12H-6A-00-0-0"]
["4000K, 94 CRI","-","-","-","-","-","-","BXEP-40H-181-24A-00-00-0 ","-","-","-","-","-","-","-","-","-","-","-","-","-","-","-","-","-"]
["4500K, 70 CRI","-","-","-","-","-","-","BXEP-45C-181-24A-00-00-0 ","-","-","-","-","BXEP-45C-435-09B-00-00-0","BXEP-45C-1C5-36B-00-00-0","-","-","-","-","-","-","-","-","-","-","BXEM-45C-12H-6A-00-0-0"]
["4500K, 80 CRI","-","-","-","-","-","-","BXEP-45E-181-24A-00-00-0 ","-","-","-","-","BXEP-45E-435-09B-00-00-0","BXEP-45E-1C5-36B-00-00-0","-","-","-","-","-","-","-","-","-","-","BXEM-45E-12H-6A-00-0-0"]
["4500K, 90 CRI","-","-","-","-","-","-","-","-","-","-","-","-",null,"-","-","-","-","-","-","-","-","-","-","BXEM-45G-12H-6A-00-0-0"]
["5000K, 70 CRI","-","-","-","-","-","BXEM-50C0000-0-000","BXEP-50C-181-24A-00-00-0 ","-","-","-","-","BXEP-50C-435-09B-00-00-0","BXEP-50C-1C5-36B-00-00-0","-","-","-","-","-","-","-","-","-","-","BXEM-50C-12H-6A-00-0-0"]
["5000K, 80 CRI","BXEN-50E-11L-3AA-00-0-0","BXEN-50E-11M-3CA-00-0-0","BXEN-50E-11M-39A-00-0-0","BXEN-50E-13H-9B-00-0-0","BXEN-50E-14H-12B-00-0-0","BXEM-50E0000-0-000","BXEP-50E-181-24A-00-00-0 ","BXEP-50E-233-09A-00-00-0","BXEP-50E-163-18A-00-00-0","BXEP-50E-435-09A-00-00-0","BXEP-50E-1C5-36A-00-00-0","BXEP-50E-435-09B-00-00-0","BXEP-50E-1C5-36B-00-00-0","BXEN-50E-11H-18A-00-0-0","BXEN-50E-11L-37A-00-0-0","BXEN-50E-13H-98-00-0-0","BXEN-50E-13H-9C-00-0-0","BXEN-50E-11M-3A-00-0-0","BXEN-50E-11M-3AA-00-00-0","BXEN-50E-12M-6A-00-0-0","-","-","-","BXEM-50E-12H-6A-00-0-0"]
["5000K, 90 CRI","-","-","-","BXEN-50G13H-9B-00-0-0","BXEN-50G-14H-12B-00-0-0","BXEM-50G0000-0-000","-","-","-","-","-","-","-","BXEN-50G-11H-18A-00-0-0","-","-","BXEN-50G-13H-9C-00-0-0","BXEN-50G-11M-3A-00-0-0","-","-","BXEN-50G-13H-99N-00-0-0","BXEN-50G-13H-9BN-00-0-0","BXEN-50G-13H-9CN-00-0-0","BXEM-50G-12H-6A-00-0-0"]
["5700K, 70 CRI","-","-","-","-","-","BXEM-57C0000-0-000","BXEP-57C-181-24A-00-00-0 ","-","-","-","-","BXEP-57C-435-09B-00-00-0","BXEP-57C-1C5-36B-00-00-0","-","-","-","-","-","-","-","-","-","-","BXEM-57C-12H-6A-00-0-0"]
["5700K, 80 CRI","BXEN-57E-11L-3AA-00-0-0","BXEN-57E-11M-3CA-00-0-0","BXEN-57E-11M-39A-00-0-0","BXEN-57E-13H-9B-00-0-0","BXEN-57E-14H-12B-00-0-0","BXEM-57E0000-0-000","BXEP-57E-181-24A-00-00-0 ","BXEP-57E-233-09A-00-00-0","BXEP-57E-163-18A-00-00-0","BXEP-57E-435-09A-00-00-0","BXEP-57E-1C5-36A-00-00-0","BXEP-57E-435-09B-00-00-0","BXEP-57E-1C5-36B-00-00-0","BXEN-57E-11H-18A-00-0-0","BXEN-57E-11L-37A-00-0-0","BXEN-57E-13H-98-00-0-0","BXEN-57E-13H-9C-00-0-0","BXEN-57E-11M-3A-00-0-0","BXEN-57E-11M-3AA-00-00-0","BXEN-57E-12M-6A-00-0-0","-","-","-","BXEM-57E-12H-6A-00-0-0"]
["5700K, 90 CRI","-","-","-","BXEN-57G-13H-9B-00-0-0","BXEN-57G-14H-12B-00-0-0","BXEM-57G0000-0-000","-","-","-","-","-","-","-","BXEN-57G-11H-18A-00-0-0","-","-","BXEN-57G-13H-9C-00-0-0","BXEN-57G-11M-3A-00-0-0","-","-","BXEN-57G-13H-99N-00-0-0","BXEN-57G-13H-9BN-00-0-0","BXEN-57G-13H-9CN-00-0-0","BXEM-57G-12H-6A-00-0-0"]
["6500K, 70 CRI","-","-","-","-","-","BXEM-65C0000-0-000","BXEP-65C-181-24A-00-00-0 ","-","-","-","-","BXEP-65C-435-09B-00-00-0","BXEP-65C-1C5-36B-00-00-0","-","-","-","-","-","-","-","-","-","-","BXEM-65C-12H-6A-00-0-0"]
["6500K, 80 CRI","BXEN-65E-11L-3AA-00-0-0","BXEN-65E-11M-3CA-00-0-0","BXEN-65E-11M-39A-00-0-0","BXEN-65E-13H-9B-00-0-0","BXEN-65E-14H-12B-00-0-0","BXEM-65E0000-0-000","BXEP-65E-181-24A-00-00-0 ","BXEP-65E-233-09A-00-00-0","BXEP-65E-163-18A-00-00-0","BXEP-65E-435-09A-00-00-0","BXEP-65E-1C5-36A-00-00-0","BXEP-65E-435-09B-00-00-0","BXEP-65E-1C5-36B-00-00-0","BXEN-65E-11H-18A-00-0-0","BXEN-65E-11L-37A-00-0-0","BXEN-65E-13H-98-00-0-0","BXEN-65E-13H-9C-00-0-0","BXEN-65E-11M-3A-00-0-0","BXEN-65E-11M-3AA-00-00-0","BXEN-65E-12M-6A-00-0-0","-","-","-","BXEM-65E-12H-6A-00-0-0"]
["6500K, 90 CRI","-","-","-","-","-","BXEM-65G0000-0-000","-","-","-","-","-","-","-","-","-","-","-","-","-","-","-","-","-","BXEM-65G-12H-6A-00-0-0"]
["Max. Current"]
["2200K,80 CRI","-","-","-","-","-","-","-","-","-","-","-","-","-","-","-","-","-","-","-","-","-","-","-",240]
{"$rows_left_out":266}