{"text_format":"1","workbook":"xlsx","n_sheets":4,"sheets":["User Guide","Simulator","Calculations","Data"],"not_rendered":{"charts":3,"images":8,"macros":1,"external_links":0,"defined_names":27,"comments":2,"pivot_tables":0},"unopened":[],"bounds":{"document_bytes":16777216,"sheet_cells":100000,"rows_first":2000,"rows_last":500,"rows_between":2000,"halvings":0,"cell_chars":16384,"cell_head_chars":4096},"cells_cut":0,"cells_raw":0,"read":"whole","date_system":"1900"}

{"sheet":"User Guide","index":0,"n_rows":98,"n_cols":4,"rows_kept":98,"cut":false,"hidden":false,"merged":[[72,2,72,10],[79,2,79,10],[88,2,88,10],[95,2,95,10],[97,2,97,10],[30,2,30,10],[55,2,55,10],[7,2,7,10],[23,2,23,10],[47,2,47,10],[54,3,54,10]]}
[]
[]
[null,null,"Bridgelux® Product Simulator"]
[null,null,"User Guide"]
[]
[null,null,"What does it do?"]
[]
[null,null,"Use this tool to select the most suitable Bridgelux® LED Array for an application. You can choose the array based on either the DRIVE CURRENT you want to use or the LUMEN OUTPUT you require."]
[]
[null,null,"What products are supported?"]
{"$rows_left_out":89}
{"sheet":"Simulator","index":1,"n_rows":64,"n_cols":21,"rows_kept":64,"cut":false,"hidden":false,"merged":[[63,2,63,15],[13,17,13,20],[0,4,2,12],[5,8,5,9],[7,8,7,9],[62,3,62,14],[38,17,38,20]]}
[null,null,null,null,"Bridgelux Product Simulator",null,null,null,null,null,null,null,null,null,"1.01.1"]
[null,null,null,null,null,null,null,null,null,null,null,null,null,null,null,"Rev 3"]
[null,null,null,null,null,null,null,null,null,null,null,null,null,"Valid Until",null,"2020-12-01"]
[null,null,null,"Enter color and temperature values:",null,null,null,null,null,null,null,null,null,null,"Section 1"]
[]
[null,null,null,null,null,null,null,"Color Temperature and CRI:","4000K, 90 CRI",null,{"$f":"IFERROR(INDEX(CCT_CRI32354[],MATCH(I6,CCT_CRI32354[CCT/CRI],0),2),\"-\")","v":"40G"}]
[]
[null,null,null,null,null,null,null,"Case Temperature (°C):",25,null,"of the","Case"]
[]
[]
{"$rows_left_out":55}
{"sheet":"Calculations","index":2,"n_rows":73,"n_cols":50,"rows_kept":73,"cut":false,"hidden":true,"merged":[[56,38,56,41],[54,0,60,0],[55,2,55,5],[55,7,55,10],[55,16,55,28],[55,31,55,43],[55,46,55,48],[54,2,54,5],[54,7,54,10],[54,16,54,28],[54,31,54,43],[54,46,54,48],[24,46,24,48],[25,2,25,5],[25,7,25,10],[25,16,25,28],[25,31,25,43],[25,46,25,48],[24,0,30,0],[24,2,24,5],[24,7,24,10],[24,16,24,28],[24,31,24,43],[26,17,26,20],[26,23,26,26],[26,33,26,36],[26,38,26,41],[46,0,52,0],[18,23,18,26],[46,2,46,5],[46,7,46,10],[46,16,46,28],[48,23,48,26],[32,0,42,0],[32,2,32,5],[32,7,32,10],[32,16,32,28],[33,2,33,5],[33,7,33,10],[33,16,33,28],[47,2,47,5],[47,7,47,10],[47,16,47,28],[2,46,2,48],[18,38,18,41],[16,46,16,48],[2,0,12,0],[4,17,4,20],[16,0,22,0],[16,2,16,5],[16,7,16,10],[17,2,17,5],[17,7,17,10],[17,46,17,48],[18,17,18,20],[17,31,17,43],[18,33,18,36],[3,46,3,48],[16,16,16,28],[34,33,34,36],[34,38,34,41],[16,31,16,43],[17,16,17,28],[62,17,62,19],[32,31,32,43],[33,31,33,43],[34,17,34,20],[48,17,48,20],[48,38,48,41],[47,31,47,43],[46,31,46,43],[48,33,48,36],[56,17,56,20],[56,23,56,26],[56,33,56,36],[46,46,46,48],[47,46,47,48],[2,2,2,5],[2,7,2,10],[2,16,2,28],[2,31,2,43],[4,23,4,26],[4,33,4,36],[4,38,4,41],[3,2,3,5],[3,7,3,10],[3,16,3,28],[3,31,3,43],[32,46,32,48],[33,46,33,48],[34,23,34,26]]}
[]
[]
["Calculations using Current Input",null,"Converting Tc to Tj",null,null,null,null,"Converting Tj to Tc",null,null,null,null,null,null,null,null,"Calculating Flux",null,null,null,null,null,null,null,null,null,null,null,null,null,null,"Calculating Voltage w/ Tc",null,null,null,null,null,null,null,null,null,null,null,null,null,null,"Calculating Voltage w/ Tj"]
[null,null,"Tj = Tc + Power*Thermal Resistance",null,null,null,null,"Tc = Tj - Power*Thermal Resistance",null,null,null,null,null,null,null,null,"F@Tc&I = Ft*Fr@I*Fr@Tc",null,null,null,null,null,null,null,null,null,null,null,null,null,null,"Vf@Tc&I = Vf@I + Vf@Tc-Vft",null,null,null,null,null,null,null,null,null,null,null,null,null,null,"Vf@Tj&I = Vf@I + Vf@Tj Modifier"]
[null,null,"Tc","Power","Thermal Resistance","Tc>>Tj",null,"Tj","Power","Thermal Resistance","Tj>>Tc",null,"Tc","Tj",{"$f":"IF(Simulator!$L$8=\"Case\",\"Tj\",\"Tc\")","v":"Tj"},null,"Ft","Fr@I Eqn",null,null,null,"Fr@I",null,"Fr@Tc Eqn",null,null,null,"Fr@Tc","F@Tc&I",null,"85 DC Factor","Vft",null,"Vf@I Eqn",null,null,null,"Vf@I","Vf@Tc Eqn",null,null,null,"Vf@Tc","Vf@Tc&I",null,"# of Die","Vf@I","Vf@Tj Modifier, per Die","Vf@Tj&I","Voltage Report"]
[null,"V6",{"$f":"IF(Simulator!$L$8=\"Case\",Simulator!$I$8,M6)","v":25},{"$f":"Simulator!$O$12*AR6/1000","v":{"$error":"#N/A"}},{"$f":"INDEX(MasterTable[],MATCH(Simulator!E15,MasterTable[P/N],0),COLUMN(MasterTable[Thermal Resistance]))","v":{"$error":"#N/A"}},{"$f":"C6+D6*E6","v":{"$error":"#N/A"}},null,{"$f":"IF(Simulator!$L$8=\"Case\",F6,Simulator!$I$8)","v":{"$error":"#N/A"}},{"$f":"Simulator!$O$12*AW6/1000","v":{"$error":"#N/A"}},{"$f":"E6","v":{"$error":"#N/A"}},{"$f":"H6-I6*J6","v":{"$error":"#N/A"}},null,{"$f":"IF(Simulator!$L$8=\"Case\",Simulator!$I$8,K6)","v":25},{"$f":"IF(Simulator!$L$8=\"Case\",H6,Simulator!$I$8)","v":{"$error":"#N/A"}},{"$f":"IF(#REF!=\"Tj\",N6,M6)","v":{"$error":"#REF!"}},null,{"$f":"INDEX(MasterTable[],MATCH(Simulator!E15,MasterTable[P/N],0),COLUMN(MasterTable[Typical Lumens]))","v":{"$error":"#N/A"}},{"$f":"INDEX(MasterTable[],MATCH(Simulator!$E15,MasterTable[P/N],0),COLUMN(MasterTable[I^3]))","v":{"$error":"#N/A"}},{"$f":"INDEX(MasterTable[],MATCH(Simulator!$E15,MasterTable[P/N],0),COLUMN(MasterTable[I^2]))","v":{"$error":"#N/A"}},{"$f":"INDEX(MasterTable[],MATCH(Simulator!$E15,MasterTable[P/N],0),COLUMN(MasterTable[I]))","v":{"$error":"#N/A"}},{"$f":"INDEX(MasterTable[],MATCH(Simulator!$E15,MasterTable[P/N],0),COLUMN(MasterTable[I0]))","v":{"$error":"#N/A"}},{"$f":"IF(Simulator!$O$12=Simulator!M15,1,R6*Simulator!$O$12^3+S6*Simulator!$O$12^2+T6*Simulator!$O$12+U6)","v":{"$error":"#N/A"}},{"$f":"INDEX(MasterTable[],MATCH(Simulator!$E15,MasterTable[P/N],0),COLUMN(MasterTable[F^4]))","v":{"$error":"#N/A"}},{"$f":"INDEX(MasterTable[],MATCH(Simulator!$E15,MasterTable[P/N],0),COLUMN(MasterTable[F^3]))","v":{"$error":"#N/A"}},{"$f":"INDEX(MasterTable[],MATCH(Simulator!$E15,MasterTable[P/N],0),COLUMN(MasterTable[F^2]))","v":{"$error":"#N/A"}},{"$f":"INDEX(MasterTable[],MATCH(Simulator!$E15,MasterTable[P/N],0),COLUMN(MasterTable[F]))","v":{"$error":"#N/A"}},{"$f":"INDEX(MasterTable[],MATCH(Simulator!$E15,MasterTable[P/N],0),COLUMN(MasterTable[F0]))","v":{"$error":"#N/A"}},{"$f":"IF(Simulator!$I$8=85,AE6,W6*M6^4+X6*M6^3+Y6*M6^2+Z6*M6+AA6)","v":{"$error":"#N/A"}},{"$f":"Q6*V6*AB6","v":{"$error":"#N/A"}},{"$f":"IF(AND(Simulator!$I$8=85,Simulator!$O$12=Simulator!M15),Q6*AE6,AC6)","v":{"$error":"#N/A"}},{"$f":"VLOOKUP(MID(Simulator!E15,6,3),V_6_85DC_Factor,2,FALSE)","v":{"$error":"#N/A"}},{"$f":"INDEX(MasterTable[],MATCH(Simulator!$E15,MasterTable[P/N],0),COLUMN(MasterTable[Typical Voltage]))","v":{"$error":"#N/A"}},{"$f":"INDEX(MasterTable[],MATCH(Simulator!$E15,MasterTable[P/N],0),COLUMN(MasterTable[V^4]))","v":{"$error":"#N/A"}},{"$f":"INDEX(MasterTable[],MATCH(Simulator!$E15,MasterTable[P/N],0),COLUMN(MasterTable[V^3]))","v":{"$error":"#N/A"}},{"$f":"INDEX(MasterTable[],MATCH(Simulator!$E15,MasterTable[P/N],0),COLUMN(MasterTable[V^2]))","v":{"$error":"#N/A"}},{"$f":"INDEX(MasterTable[],MATCH(Simulator!$E15,MasterTable[P/N],0),COLUMN(MasterTable[V]))","v":{"$error":"#N/A"}},{"$f":"INDEX(MasterTable[],MATCH(Simulator!$E15,MasterTable[P/N],0),COLUMN(MasterTable[V0]))","v":{"$error":"#N/A"}},{"$f":"AG6*Simulator!$O$12^4+AH6*Simulator!$O$12^3+AI6*Simulator!$O$12^2+AJ6*Simulator!$O$12+AK6","v":{"$error":"#N/A"}},{"$f":"INDEX(MasterTable[],MATCH(Simulator!$E15,MasterTable[P/N],0),COLUMN(MasterTable[T^3]))","v":{"$error":"#N/A"}},{"$f":"INDEX(MasterTable[],MATCH(Simulator!$E15,MasterTable[P/N],0),COLUMN(MasterTable[T^2]))","v":{"$error":"#N/A"}},{"$f":"INDEX(MasterTable[],MATCH(Simulator!$E15,MasterTable[P/N],0),COLUMN(MasterTable[T]))","v":{"$error":"#N/A"}},{"$f":"INDEX(MasterTable[],MATCH(Simulator!$E15,MasterTable[P/N],0),COLUMN(MasterTable[T0]))","v":{"$error":"#N/A"}},{"$f":"AM6*M6^3+AN6*M6^2+AO6*M6+AP6","v":{"$error":"#N/A"}},{"$f":"AL6+AQ6-AF6","v":{"$error":"#N/A"}},null,{"$f":"INDEX(MasterTable[],MATCH(Simulator!$E15,MasterTable[P/N],0),COLUMN(MasterTable['# of Die]))","v":{"$error":"#N/A"}},{"$f":"AL6","v":{"$error":"#N/A"}},{"$f":"INDEX(Tj_to_Vf6[],MATCH(Simulator!$I$8,Tj_to_Vf6[Vf],1),COLUMN(Tj_to_Vf6[Vf]))","v":-0.5},{"$f":"AU6+AV6*AT6","v":{"$error":"#N/A"}},{"$f":"IF(AND(Simulator!$I$8=25,Simulator!$O$12=Simulator!M15),AF6,AR6)","v":{"$error":"#N/A"}}]
[null,"V6",{"$f":"IF(Simulator!$L$8=\"Case\",Simulator!$I$8,M7)","v":25},{"$f":"Simulator!$O$12*AR7/1000","v":{"$error":"#N/A"}},{"$f":"INDEX(MasterTable[],MATCH(Simulator!E16,MasterTable[P/N],0),COLUMN(MasterTable[Thermal Resistance]))","v":{"$error":"#N/A"}},{"$f":"C7+D7*E7","v":{"$error":"#N/A"}},null,{"$f":"IF(Simulator!$L$8=\"Case\",F7,Simulator!$I$8)","v":{"$error":"#N/A"}},{"$f":"Simulator!$O$12*AW7/1000","v":{"$error":"#N/A"}},{"$f":"E7","v":{"$error":"#N/A"}},{"$f":"H7-I7*J7","v":{"$error":"#N/A"}},null,{"$f":"IF(Simulator!$L$8=\"Case\",Simulator!$I$8,K7)","v":25},{"$f":"IF(Simulator!$L$8=\"Case\",H7,Simulator!$I$8)","v":{"$error":"#N/A"}},{"$f":"IF(#REF!=\"Tj\",N7,M7)","v":{"$error":"#REF!"}},null,{"$f":"INDEX(MasterTable[],MATCH(Simulator!E16,MasterTable[P/N],0),COLUMN(MasterTable[Typical Lumens]))","v":{"$error":"#N/A"}},{"$f":"INDEX(MasterTable[],MATCH(Simulator!$E16,MasterTable[P/N],0),COLUMN(MasterTable[I^3]))","v":{"$error":"#N/A"}},{"$f":"INDEX(MasterTable[],MATCH(Simulator!$E16,MasterTable[P/N],0),COLUMN(MasterTable[I^2]))","v":{"$error":"#N/A"}},{"$f":"INDEX(MasterTable[],MATCH(Simulator!$E16,MasterTable[P/N],0),COLUMN(MasterTable[I]))","v":{"$error":"#N/A"}},{"$f":"INDEX(MasterTable[],MATCH(Simulator!$E16,MasterTable[P/N],0),COLUMN(MasterTable[I0]))","v":{"$error":"#N/A"}},{"$f":"IF(Simulator!$O$12=Simulator!M16,1,R7*Simulator!$O$12^3+S7*Simulator!$O$12^2+T7*Simulator!$O$12+U7)","v":{"$error":"#N/A"}},{"$f":"INDEX(MasterTable[],MATCH(Simulator!$E16,MasterTable[P/N],0),COLUMN(MasterTable[F^4]))","v":{"$error":"#N/A"}},{"$f":"INDEX(MasterTable[],MATCH(Simulator!$E16,MasterTable[P/N],0),COLUMN(MasterTable[F^3]))","v":{"$error":"#N/A"}},{"$f":"INDEX(MasterTable[],MATCH(Simulator!$E16,MasterTable[P/N],0),COLUMN(MasterTable[F^2]))","v":{"$error":"#N/A"}},{"$f":"INDEX(MasterTable[],MATCH(Simulator!$E16,MasterTable[P/N],0),COLUMN(MasterTable[F]))","v":{"$error":"#N/A"}},{"$f":"INDEX(MasterTable[],MATCH(Simulator!$E16,MasterTable[P/N],0),COLUMN(MasterTable[F0]))","v":{"$error":"#N/A"}},{"$f":"IF(Simulator!$I$8=85,AE7,W7*M7^4+X7*M7^3+Y7*M7^2+Z7*M7+AA7)","v":{"$error":"#N/A"}},{"$f":"Q7*V7*AB7","v":{"$error":"#N/A"}},{"$f":"IF(AND(Simulator!$I$8=85,Simulator!$O$12=Simulator!M16),Q7*AE7,AC7)","v":{"$error":"#N/A"}},{"$f":"VLOOKUP(MID(Simulator!E16,6,3),V_6_85DC_Factor,2,FALSE)","v":{"$error":"#N/A"}},{"$f":"INDEX(MasterTable[],MATCH(Simulator!$E16,MasterTable[P/N],0),COLUMN(MasterTable[Typical Voltage]))","v":{"$error":"#N/A"}},{"$f":"INDEX(MasterTable[],MATCH(Simulator!$E16,MasterTable[P/N],0),COLUMN(MasterTable[V^4]))","v":{"$error":"#N/A"}},{"$f":"INDEX(MasterTable[],MATCH(Simulator!$E16,MasterTable[P/N],0),COLUMN(MasterTable[V^3]))","v":{"$error":"#N/A"}},{"$f":"INDEX(MasterTable[],MATCH(Simulator!$E16,MasterTable[P/N],0),COLUMN(MasterTable[V^2]))","v":{"$error":"#N/A"}},{"$f":"INDEX(MasterTable[],MATCH(Simulator!$E16,MasterTable[P/N],0),COLUMN(MasterTable[V]))","v":{"$error":"#N/A"}},{"$f":"INDEX(MasterTable[],MATCH(Simulator!$E16,MasterTable[P/N],0),COLUMN(MasterTable[V0]))","v":{"$error":"#N/A"}},{"$f":"AG7*Simulator!$O$12^4+AH7*Simulator!$O$12^3+AI7*Simulator!$O$12^2+AJ7*Simulator!$O$12+AK7","v":{"$error":"#N/A"}},{"$f":"INDEX(MasterTable[],MATCH(Simulator!$E16,MasterTable[P/N],0),COLUMN(MasterTable[T^3]))","v":{"$error":"#N/A"}},{"$f":"INDEX(MasterTable[],MATCH(Simulator!$E16,MasterTable[P/N],0),COLUMN(MasterTable[T^2]))","v":{"$error":"#N/A"}},{"$f":"INDEX(MasterTable[],MATCH(Simulator!$E16,MasterTable[P/N],0),COLUMN(MasterTable[T]))","v":{"$error":"#N/A"}},{"$f":"INDEX(MasterTable[],MATCH(Simulator!$E16,MasterTable[P/N],0),COLUMN(MasterTable[T0]))","v":{"$error":"#N/A"}},{"$f":"AM7*M7^3+AN7*M7^2+AO7*M7+AP7","v":{"$error":"#N/A"}},{"$f":"AL7+AQ7-AF7","v":{"$error":"#N/A"}},null,{"$f":"INDEX(MasterTable[],MATCH(Simulator!$E16,MasterTable[P/N],0),COLUMN(MasterTable['# of Die]))","v":{"$error":"#N/A"}},{"$f":"AL7","v":{"$error":"#N/A"}},{"$f":"INDEX(Tj_to_Vf6[],MATCH(Simulator!$I$8,Tj_to_Vf6[Vf],1),COLUMN(Tj_to_Vf6[Vf]))","v":-0.5},{"$f":"AU7+AV7*AT7","v":{"$error":"#N/A"}},{"$f":"IF(AND(Simulator!$I$8=25,Simulator!$O$12=Simulator!M16),AF7,AR7)","v":{"$error":"#N/A"}}]
[null,"V8",{"$f":"IF(Simulator!$L$8=\"Case\",Simulator!$I$8,M8)","v":25},{"$f":"Simulator!$O$12*AR8/1000","v":{"$error":"#N/A"}},{"$f":"INDEX(MasterTable[],MATCH(Simulator!E17,MasterTable[P/N],0),COLUMN(MasterTable[Thermal Resistance]))","v":{"$error":"#N/A"}},{"$f":"C8+D8*E8","v":{"$error":"#N/A"}},null,{"$f":"IF(Simulator!$L$8=\"Case\",F8,Simulator!$I$8)","v":{"$error":"#N/A"}},{"$f":"Simulator!$O$12*AW8/1000","v":{"$error":"#N/A"}},{"$f":"E8","v":{"$error":"#N/A"}},{"$f":"H8-I8*J8","v":{"$error":"#N/A"}},null,{"$f":"IF(Simulator!$L$8=\"Case\",Simulator!$I$8,K8)","v":25},{"$f":"IF(Simulator!$L$8=\"Case\",H8,Simulator!$I$8)","v":{"$error":"#N/A"}},{"$f":"IF(#REF!=\"Tj\",N8,M8)","v":{"$error":"#REF!"}},null,{"$f":"INDEX(MasterTable[],MATCH(Simulator!E17,MasterTable[P/N],0),COLUMN(MasterTable[Typical Lumens]))","v":{"$error":"#N/A"}},{"$f":"INDEX(MasterTable[],MATCH(Simulator!$E17,MasterTable[P/N],0),COLUMN(MasterTable[I^3]))","v":{"$error":"#N/A"}},{"$f":"INDEX(MasterTable[],MATCH(Simulator!$E17,MasterTable[P/N],0),COLUMN(MasterTable[I^2]))","v":{"$error":"#N/A"}},{"$f":"INDEX(MasterTable[],MATCH(Simulator!$E17,MasterTable[P/N],0),COLUMN(MasterTable[I]))","v":{"$error":"#N/A"}},{"$f":"INDEX(MasterTable[],MATCH(Simulator!$E17,MasterTable[P/N],0),COLUMN(MasterTable[I0]))","v":{"$error":"#N/A"}},{"$f":"IF(Simulator!$O$12=Simulator!M17,1,R8*Simulator!$O$12^3+S8*Simulator!$O$12^2+T8*Simulator!$O$12+U8)","v":{"$error":"#N/A"}},{"$f":"INDEX(MasterTable[],MATCH(Simulator!$E17,MasterTable[P/N],0),COLUMN(MasterTable[F^4]))","v":{"$error":"#N/A"}},{"$f":"INDEX(MasterTable[],MATCH(Simulator!$E17,MasterTable[P/N],0),COLUMN(MasterTable[F^3]))","v":{"$error":"#N/A"}},{"$f":"INDEX(MasterTable[],MATCH(Simulator!$E17,MasterTable[P/N],0),COLUMN(MasterTable[F^2]))","v":{"$error":"#N/A"}},{"$f":"INDEX(MasterTable[],MATCH(Simulator!$E17,MasterTable[P/N],0),COLUMN(MasterTable[F]))","v":{"$error":"#N/A"}},{"$f":"INDEX(MasterTable[],MATCH(Simulator!$E17,MasterTable[P/N],0),COLUMN(MasterTable[F0]))","v":{"$error":"#N/A"}},{"$f":"IF(Simulator!$I$8=85,AE8,W8*M8^4+X8*M8^3+Y8*M8^2+Z8*M8+AA8)","v":{"$error":"#N/A"}},{"$error":"#N/A"},{"$f":"IF(AND(Simulator!O17=85,Simulator!$O$12=Simulator!M17),Q8*$AE$13,AC8)","v":{"$error":"#N/A"}},null,{"$f":"INDEX(MasterTable[],MATCH(Simulator!$E17,MasterTable[P/N],0),COLUMN(MasterTable[Typical Voltage]))","v":{"$error":"#N/A"}},{"$f":"INDEX(MasterTable[],MATCH(Simulator!$E17,MasterTable[P/N],0),COLUMN(MasterTable[V^4]))","v":{"$error":"#N/A"}},{"$f":"INDEX(MasterTable[],MATCH(Simulator!$E17,MasterTable[P/N],0),COLUMN(MasterTable[V^3]))","v":{"$error":"#N/A"}},{"$f":"INDEX(MasterTable[],MATCH(Simulator!$E17,MasterTable[P/N],0),COLUMN(MasterTable[V^2]))","v":{"$error":"#N/A"}},{"$f":"INDEX(MasterTable[],MATCH(Simulator!$E17,MasterTable[P/N],0),COLUMN(MasterTable[V]))","v":{"$error":"#N/A"}},{"$f":"INDEX(MasterTable[],MATCH(Simulator!$E17,MasterTable[P/N],0),COLUMN(MasterTable[V0]))","v":{"$error":"#N/A"}},{"$f":"AG8*Simulator!$O$12^4+AH8*Simulator!$O$12^3+AI8*Simulator!$O$12^2+AJ8*Simulator!$O$12+AK8","v":{"$error":"#N/A"}},{"$f":"INDEX(MasterTable[],MATCH(Simulator!$E17,MasterTable[P/N],0),COLUMN(MasterTable[T^3]))","v":{"$error":"#N/A"}},{"$f":"INDEX(MasterTable[],MATCH(Simulator!$E17,MasterTable[P/N],0),COLUMN(MasterTable[T^2]))","v":{"$error":"#N/A"}},{"$f":"INDEX(MasterTable[],MATCH(Simulator!$E17,MasterTable[P/N],0),COLUMN(MasterTable[T]))","v":{"$error":"#N/A"}},{"$f":"INDEX(MasterTable[],MATCH(Simulator!$E17,MasterTable[P/N],0),COLUMN(MasterTable[T0]))","v":{"$error":"#N/A"}},{"$error":"#N/A"},{"$error":"#N/A"},null,{"$f":"INDEX(MasterTable[],MATCH(Simulator!$E17,MasterTable[P/N],0),COLUMN(MasterTable['# of Die]))","v":{"$error":"#N/A"}},{"$error":"#N/A"},{"$f":"INDEX(Tj_to_Vf6[],MATCH(Simulator!$I$8,Tj_to_Vf6[Vf],1),COLUMN(Tj_to_Vf6[Vf]))","v":-0.5},{"$error":"#N/A"},{"$f":"IF(AND(Simulator!$I$8=25,Simulator!$O$12=Simulator!M17),AF8,AR8)","v":{"$error":"#N/A"}}]
[null,"V8",{"$f":"IF(Simulator!$L$8=\"Case\",Simulator!$I$8,M9)","v":25},{"$f":"Simulator!$O$12*AR9/1000","v":7.2136000000000013},{"$f":"INDEX(MasterTable[],MATCH(Simulator!E18,MasterTable[P/N],0),COLUMN(MasterTable[Thermal Resistance]))","v":0.71},{"$f":"C9+D9*E9","v":30.121656000000002},null,{"$f":"IF(Simulator!$L$8=\"Case\",F9,Simulator!$I$8)","v":30.121656000000002},{"$f":"Simulator!$O$12*AW9/1000","v":6.0136000000000012},{"$f":"E9","v":0.71},{"$f":"H9-I9*J9","v":25.852},null,{"$f":"IF(Simulator!$L$8=\"Case\",Simulator!$I$8,K9)","v":25},{"$f":"IF(Simulator!$L$8=\"Case\",H9,Simulator!$I$8)","v":30.121656000000002},{"$f":"IF(#REF!=\"Tj\",N9,M9)","v":{"$error":"#REF!"}},null,{"$f":"INDEX(MasterTable[],MATCH(Simulator!E18,MasterTable[P/N],0),COLUMN(MasterTable[Typical Lumens]))","v":716},{"$f":"INDEX(MasterTable[],MATCH(Simulator!$E18,MasterTable[P/N],0),COLUMN(MasterTable[I^3]))","v":0},{"$f":"INDEX(MasterTable[],MATCH(Simulator!$E18,MasterTable[P/N],0),COLUMN(MasterTable[I^2]))","v":-4.1047244976000001E-6},{"$f":"INDEX(MasterTable[],MATCH(Simulator!$E18,MasterTable[P/N],0),COLUMN(MasterTable[I]))","v":6.3759312470999998E-3},{"$f":"INDEX(MasterTable[],MATCH(Simulator!$E18,MasterTable[P/N],0),COLUMN(MasterTable[I0]))","v":7.2647760056000002E-3},{"$f":"IF(Simulator!$O$12=Simulator!M18,1,R9*Simulator!$O$12^3+S9*Simulator!$O$12^2+T9*Simulator!$O$12+U9)","v":1.1182620455215999},{"$f":"INDEX(MasterTable[],MATCH(Simulator!$E18,MasterTable[P/N],0),COLUMN(MasterTable[F^4]))","v":0},{"$f":"INDEX(MasterTable[],MATCH(Simulator!$E18,MasterTable[P/N],0),COLUMN(MasterTable[F^3]))","v":0},{"$f":"INDEX(MasterTable[],MATCH(Simulator!$E18,MasterTable[P/N],0),COLUMN(MasterTable[F^2]))","v":-6.6243244394999998E-6},{"$f":"INDEX(MasterTable[],MATCH(Simulator!$E18,MasterTable[P/N],0),COLUMN(MasterTable[F]))","v":-1.1278369862E-3},{"$f":"INDEX(MasterTable[],MATCH(Simulator!$E18,MasterTable[P/N],0),COLUMN(MasterTable[F0]))","v":1.0309770566000001},{"$f":"IF(Simulator!$I$8=85,AE9,W9*M9^4+X9*M9^3+Y9*M9^2+Z9*M9+AA9)","v":0.99864092917031255},799.58744970803878,{"$f":"IF(AND(Simulator!$I$8=85,Simulator!$O$12=Simulator!M18),Q9*AE9,AC9)","v":799.58744970803878},{"$f":"VLOOKUP(MID(Simulator!E18,6,3),V_8_85DC_Factor,2,FALSE)","v":0.88},{"$f":"INDEX(MasterTable[],MATCH(Simulator!$E18,MasterTable[P/N],0),COLUMN(MasterTable[Typical Voltage]))","v":35.6},{"$f":"INDEX(MasterTable[],MATCH(Simulator!$E18,MasterTable[P/N],0),COLUMN(MasterTable[V^4]))","v":-1.0000000000000001E-9},{"$f":"INDEX(MasterTable[],MATCH(Simulator!$E18,MasterTable[P/N],0),COLUMN(MasterTable[V^3]))","v":8.6600000000000005E-7},{"$f":"INDEX(MasterTable[],MATCH(Simulator!$E18,MasterTable[P/N],0),COLUMN(MasterTable[V^2]))","v":-2.7099999999999997E-4},{"$f":"INDEX(MasterTable[],MATCH(Simulator!$E18,MasterTable[P/N],0),COLUMN(MasterTable[V]))","v":5.4899999999999997E-2},{"$f":"INDEX(MasterTable[],MATCH(Simulator!$E18,MasterTable[P/N],0),COLUMN(MasterTable[V0]))","v":30.6},{"$f":"AG9*Simulator!$O$12^4+AH9*Simulator!$O$12^3+AI9*Simulator!$O$12^2+AJ9*Simulator!$O$12+AK9","v":36.068000000000005},{"$f":"INDEX(MasterTable[],MATCH(Simulator!$E18,MasterTable[P/N],0),COLUMN(MasterTable[T^3]))","v":0},{"$f":"INDEX(MasterTable[],MATCH(Simulator!$E18,MasterTable[P/N],0),COLUMN(MasterTable[T^2]))","v":0},{"$f":"INDEX(MasterTable[],MATCH(Simulator!$E18,MasterTable[P/N],0),COLUMN(MasterTable[T]))","v":-1.7000000000000001E-2},{"$f":"INDEX(MasterTable[],MATCH(Simulator!$E18,MasterTable[P/N],0),COLUMN(MasterTable[T0]))","v":36.024999999999999},35.6,36.068000000000005,null,{"$f":"INDEX(MasterTable[],MATCH(Simulator!$E18,MasterTable[P/N],0),COLUMN(MasterTable['# of Die]))","v":12},36.068000000000005,{"$f":"INDEX(Tj_to_Vf6[],MATCH(Simulator!$I$8,Tj_to_Vf6[Vf],1),COLUMN(Tj_to_Vf6[Vf]))","v":-0.5},30.068000000000005,{"$f":"IF(AND(Simulator!$I$8=25,Simulator!$O$12=Simulator!M18),AF9,AR9)","v":36.068000000000005}]
[null,"V8",{"$f":"IF(Simulator!$L$8=\"Case\",Simulator!$I$8,M10)","v":25},{"$f":"Simulator!$O$12*AR10/1000","v":3.4069644816067202},{"$f":"INDEX(MasterTable[],MATCH(Simulator!E19,MasterTable[P/N],0),COLUMN(MasterTable[Thermal Resistance]))","v":0.71},{"$f":"C10+D10*E10","v":27.41894478194077},null,{"$f":"IF(Simulator!$L$8=\"Case\",F10,Simulator!$I$8)","v":27.41894478194077},{"$f":"Simulator!$O$12*AW10/1000","v":2.20696448160672},{"$f":"E10","v":0.71},{"$f":"H10-I10*J10","v":25.851999999999997},null,{"$f":"IF(Simulator!$L$8=\"Case\",Simulator!$I$8,K10)","v":25},{"$f":"IF(Simulator!$L$8=\"Case\",H10,Simulator!$I$8)","v":27.41894478194077},{"$f":"IF(#REF!=\"Tj\",N10,M10)","v":{"$error":"#REF!"}},null,{"$f":"INDEX(MasterTable[],MATCH(Simulator!E19,MasterTable[P/N],0),COLUMN(MasterTable[Typical Lumens]))","v":716},{"$f":"INDEX(MasterTable[],MATCH(Simulator!$E19,MasterTable[P/N],0),COLUMN(MasterTable[I^3]))","v":0},{"$f":"INDEX(MasterTable[],MATCH(Simulator!$E19,MasterTable[P/N],0),COLUMN(MasterTable[I^2]))","v":-1.0261811244E-6},{"$f":"INDEX(MasterTable[],MATCH(Simulator!$E19,MasterTable[P/N],0),COLUMN(MasterTable[I]))","v":3.1879656235999998E-3},{"$f":"INDEX(MasterTable[],MATCH(Simulator!$E19,MasterTable[P/N],0),COLUMN(MasterTable[I0]))","v":7.2647760056000002E-3},{"$f":"IF(Simulator!$O$12=Simulator!M19,1,R10*Simulator!$O$12^3+S10*Simulator!$O$12^2+T10*Simulator!$O$12+U10)","v":0.60381065574960002},{"$f":"INDEX(MasterTable[],MATCH(Simulator!$E19,MasterTable[P/N],0),COLUMN(MasterTable[F^4]))","v":0},{"$f":"INDEX(MasterTable[],MATCH(Simulator!$E19,MasterTable[P/N],0),COLUMN(MasterTable[F^3]))","v":0},{"$f":"INDEX(MasterTable[],MATCH(Simulator!$E19,MasterTable[P/N],0),COLUMN(MasterTable[F^2]))","v":-6.6243244394999998E-6},{"$f":"INDEX(MasterTable[],MATCH(Simulator!$E19,MasterTable[P/N],0),COLUMN(MasterTable[F]))","v":-1.1278369862E-3},{"$f":"INDEX(MasterTable[],MATCH(Simulator!$E19,MasterTable[P/N],0),COLUMN(MasterTable[F0]))","v":1.0309770566000001},{"$f":"IF(Simulator!$I$8=85,AE10,W10*M10^4+X10*M10^3+Y10*M10^2+Z10*M10+AA10)","v":0.99864092917031255},431.74086455931291,{"$f":"IF(AND(Simulator!$I$8=85,Simulator!$O$12=Simulator!M19),Q10*AE10,AC10)","v":431.74086455931291},{"$f":"VLOOKUP(MID(Simulator!E19,6,3),V_8_85DC_Factor,2,FALSE)","v":0.88},{"$f":"INDEX(MasterTable[],MATCH(Simulator!$E19,MasterTable[P/N],0),COLUMN(MasterTable[Typical Voltage]))","v":17.8},{"$f":"INDEX(MasterTable[],MATCH(Simulator!$E19,MasterTable[P/N],0),COLUMN(MasterTable[V^4]))","v":-7.4382650239000006E-11},{"$f":"INDEX(MasterTable[],MATCH(Simulator!$E19,MasterTable[P/N],0),COLUMN(MasterTable[V^3]))","v":9.4360629142000003E-8},{"$f":"INDEX(MasterTable[],MATCH(Simulator!$E19,MasterTable[P/N],0),COLUMN(MasterTable[V^2]))","v":-4.4394203422999998E-5},{"$f":"INDEX(MasterTable[],MATCH(Simulator!$E19,MasterTable[P/N],0),COLUMN(MasterTable[V]))","v":1.4251995236000001E-2},{"$f":"INDEX(MasterTable[],MATCH(Simulator!$E19,MasterTable[P/N],0),COLUMN(MasterTable[V0]))","v":15.324318705},{"$f":"AG10*Simulator!$O$12^4+AH10*Simulator!$O$12^3+AI10*Simulator!$O$12^2+AJ10*Simulator!$O$12+AK10","v":17.034822408033598},{"$f":"INDEX(MasterTable[],MATCH(Simulator!$E19,MasterTable[P/N],0),COLUMN(MasterTable[T^3]))","v":0},{"$f":"INDEX(MasterTable[],MATCH(Simulator!$E19,MasterTable[P/N],0),COLUMN(MasterTable[T^2]))","v":0},{"$f":"INDEX(MasterTable[],MATCH(Simulator!$E19,MasterTable[P/N],0),COLUMN(MasterTable[T]))","v":-7.0000000000000001E-3},{"$f":"INDEX(MasterTable[],MATCH(Simulator!$E19,MasterTable[P/N],0),COLUMN(MasterTable[T0]))","v":17.975000000000001},17.8,17.034822408033602,null,{"$f":"INDEX(MasterTable[],MATCH(Simulator!$E19,MasterTable[P/N],0),COLUMN(MasterTable['# of Die]))","v":12},17.034822408033598,{"$f":"INDEX(Tj_to_Vf6[],MATCH(Simulator!$I$8,Tj_to_Vf6[Vf],1),COLUMN(Tj_to_Vf6[Vf]))","v":-0.5},11.034822408033598,{"$f":"IF(AND(Simulator!$I$8=25,Simulator!$O$12=Simulator!M19),AF10,AR10)","v":17.034822408033602}]
{"$rows_left_out":64}
{"sheet":"Data","index":3,"n_rows":254,"n_cols":43,"rows_kept":254,"cut":false,"hidden":true,"merged":[[69,14,69,16],[70,14,70,16],[70,31,70,33],[70,28,70,30],[70,22,70,25],[70,18,70,21]]}
["Thermal Resistance at max drive current",null,null,null,null,null,null,null,null,null,null,1,null,null,2,3,4,5,null,6,7,8,null,null,null,null,null,null,10,11,12,13,14,15,16,17,19,20,21,22,23,24,25]
["Form Factor","Max Current","Rth",null,null,null,"CCT/ CRI PN Creator"]
["Vero 10",700,1.49,null,null,null,"CCT/CRI","Code"]
["Vero 13",1050,0.87,null,null,null,"1750K, 80 CRI Décor","17E"]
["Vero 18",2100,0.55000000000000004,null,null,null,"2500K, 80 CRI Décor","25E"]
["Vero 29",3150,0.26,null,null,null,"2700K, 80 CRI","27E"]
["BXRA3-Star-AF",500,2.6,null,null,null,"2700K, 90 CRI","27G"]
["BXRA3-Star-AI",500,1.75,null,null,null,"2700K, 97 CRI Décor","27H"]
["BXRA3-Rect-BG",1000,0.95,null,null,null,"3000K, Class A Décor","30A"]
["BXRA3-Rect-BJ",1000,0.8,null,null,null,"3000K, 80 CRI","30E"]
{"$rows_left_out":244}