{"text_format":"1","workbook":"xlsx","n_sheets":4,"sheets":["User Guide","Simulator","Calculations","Data"],"not_rendered":{"charts":3,"images":8,"macros":1,"external_links":0,"defined_names":27,"comments":2,"pivot_tables":0},"unopened":[],"bounds":{"document_bytes":16777216,"sheet_cells":100000,"rows_first":2000,"rows_last":500,"rows_between":2000,"halvings":0,"cell_chars":16384,"cell_head_chars":4096},"cells_cut":0,"cells_raw":0,"read":"whole","date_system":"1900"}

{"sheet":"User Guide","index":0,"n_rows":98,"n_cols":4,"rows_kept":98,"cut":false,"hidden":false,"merged":[[72,2,72,10],[79,2,79,10],[88,2,88,10],[95,2,95,10],[97,2,97,10],[30,2,30,10],[55,2,55,10],[7,2,7,10],[23,2,23,10],[47,2,47,10],[54,3,54,10]]}
[]
[]
[null,null,"Bridgelux® Product Simulator"]
[null,null,"User Guide"]
[]
[null,null,"What does it do?"]
[]
[null,null,"Use this tool to select the most suitable Bridgelux® LED Array for an application. You can choose the array based on either the DRIVE CURRENT you want to use or the LUMEN OUTPUT you require."]
[]
[null,null,"What products are supported?"]
[]
[null,null,"This tool will help you select Bridgelux® Gen. 6 Vero® Series and V Series™ arrays."]
[]
[null,null,"How do I use the Product Simulator?"]
[]
[null,null,"1.     Enter basic information about your application in Section 1 of the Simulator"]
[null,null,"·         Select the required CCT and CRI from the drop down menu:"]
[null,null,"·         Enter the operating Case Temperature in degrees Celsius:"]
[]
[]
[]
[]
[]
[null,null,"2.     If you are designing to a fixed DRIVE CURRENT go to Section 2 and enter the required drive"]
[null,null,null,"current"]
[]
[]
[]
[]
[]
[null,null,"·         The Simulator will show product options for Gen. 6 Vero and V Series products"]
[]
[]
[]
[]
[]
[]
[]
[]
[]
[]
[]
[]
[]
[]
[]
[]
[null,null,"3.     If you are designing to meet a required LUMEN target, use Section 3 of the Simulator and "]
[null,null,null,"enter required lumen value:"]
[]
[]
[]
[]
[]
[null,null,"·         The Simulator will show product options and required drive currents for Gen. 7 Vero and V Series products"]
[null,null,"·         The Simulator will show product options for Gen. 6 Vero and V Series products"]
[]
[]
[]
[]
[]
[]
[]
[]
[]
[]
[]
[]
[]
[]
[]
[]
[null,null,"Note: typical lumen tested under pulsed condition (10ms pulse width) at nominal test current where Tj (junction temperature) = Tc (case temperature) = 25°C"]
[]
[]
[null,null,"How do I read the Part Number?"]
[]
[null,null,"For product nomenclature refer to product datasheets."]
[]
[null,null,"As an example, the part number designation for Bridgelux Gen. 6 Vero LED arrays is explained as follows:"]
[]
[null,null,"BXRC – AB C DEFG – H – IJ"]
[]
[null,null,"Where:"]
[]
[null,null,"BXRC – Designates product family"]
[null,null,"AB – Designates the nominal color temperature; 27 = 2700K, 30 = 3000K, etc."]
[null,null,"C – Designates minimum CRI; H = 97 typical"]
[null,null,"DEFG – Designates nominal flux; 2000 = 2,000lm, 4000 = 4,000 lm, 10K0 = 10,000 lm, etc."]
[null,null,"H – Designates array configuration"]
[null,null,"IJ – Designates CCT Bin options"]
[null,null,null,"22 = 2 SDCM"]
[null,null,null,"23 = 3 SDCM"]
[]
[null,null,"Disclaimer"]
[null,null,"Please note that the Product Simulator is solely intended to help ease your selection of Bridgelux LED array products based upon your selection of attribute options for each of the criteria provided in the Product Simulator. The Product Simulator is NOT intended as a design tool for luminaire or fixture products nor intended for the selection of LED array products to be used as a component in a particular luminaire or fixture application. Bridgelux disclaims all liability for the results of any product selection through the use of the Product Simulator."]
[]
[null,null,"1.       Calculated values in the Product Simulator are measured under stabilized direct current conditions to more accurately represent the COB performance in a typical fixture application. Please refer to the appropriate COB Datasheet and Product Selection Guide for pulsed measurement specifications."]

{"sheet":"Simulator","index":1,"n_rows":64,"n_cols":21,"rows_kept":64,"cut":false,"hidden":false,"merged":[[63,2,63,15],[13,17,13,20],[0,4,2,12],[5,8,5,9],[7,8,7,9],[62,3,62,14],[38,17,38,20]]}
[null,null,null,null,"Bridgelux Product Simulator",null,null,null,null,null,null,null,null,null,"1.01.1"]
[null,null,null,null,null,null,null,null,null,null,null,null,null,null,null,"Rev 3"]
[null,null,null,null,null,null,null,null,null,null,null,null,null,"Valid Until",null,"2020-12-01"]
[null,null,null,"Enter color and temperature values:",null,null,null,null,null,null,null,null,null,null,"Section 1"]
[]
[null,null,null,null,null,null,null,"Color Temperature and CRI:","4000K, 90 CRI",null,{"$f":"IFERROR(INDEX(CCT_CRI32354[],MATCH(I6,CCT_CRI32354[CCT/CRI],0),2),\"-\")","v":"40G"}]
[]
[null,null,null,null,null,null,null,"Case Temperature (°C):",25,null,"of the","Case"]
[]
[]
[null,null,null,"Lumen Output at Required Drive Current",null,null,null,null,null,null,null,null,null,null,"Section 2"]
[null,null,null,"Calculate lumens for selected drive current",null,null,null,null,null,null,null,null,null,"ENTER DRIVE CURRENT in mA:",200]
[null,null,null,"V Series & Vero Series"]
[null,null,null,"Product","Part Number","Config","Drive\nCurrent\n(mA)","Voltage\n(V)","Power\n(W)",{"$f":"\"Lumen @ \n\"&$L$8&\" = \"&$I$8&\"°C\"","v":"Lumen @ \nCase = 25°C"},{"$f":"\"Efficacy @ \n\"&$L$8&\" = \"&$I$8&\"°C\"","v":"Efficacy @ \nCase = 25°C"},"Max Drive\nCurrent\n(mA)","Typical\n Current\n (mA)","Typical \nLumens",{"$f":"\"Tj\"&\"\n \"\n&\"(°C)\"","v":"Tj\n (°C)"},null,null,"Efficacy (lm/W)"]
[{"$f":"D15&\"-\"&F15&\"-\"&K$6","v":"V6-AF-40G"},null,null,"V6",{"$f":"IFERROR(INDEX(MasterTable[],MATCH(A15,MasterTable[PF+CR],0),7),\"-\")","v":"-"},"AF",{"$f":"IF(E15=\"-\",\"-\",(IF(L15<O$12,\"-\",O$12)))","v":"-"},{"$f":"IFERROR(IF(G15,Calculations!AX6,\"-\"),\"-\")","v":"-"},{"$f":"IFERROR(G15*H15/1000,\"-\")","v":"-"},{"$f":"IFERROR(MROUND(IF(G15=$O$12,Calculations!AD6,\"-\"),5),\"-\")","v":"-"},{"$f":"IFERROR(J15/I15,\"-\")","v":"-"},{"$f":"IFERROR(INDEX(MasterTable[],MATCH(A15,MasterTable[PF+CR],0),COLUMN(MasterTable[Max Current])),\"-\")","v":"-"},{"$f":"IFERROR(INDEX(MasterTable[],MATCH(Simulator!E15,MasterTable[P/N],0),COLUMN(MasterTable[Typical Current])),\"-\")","v":"-"},{"$f":"IFERROR(INDEX(MasterTable[],MATCH(Simulator!E15,MasterTable[P/N],0),COLUMN(MasterTable[Typical Lumens])),\"-\")","v":"-"},{"$f":"IFERROR(IF(G15,Calculations!F6,\"-\"),\"-\")","v":"-"},null,null,"Efficacy (lm/W)","Efficacy (lm/W)","Efficacy (lm/W)","Efficacy (lm/W)"]
[{"$f":"D16&\"-\"&F16&\"-\"&K$6","v":"V6-BC-40G"},null,null,"V6",{"$f":"IFERROR(INDEX(MasterTable[],MATCH(A16,MasterTable[PF+CR],0),7),\"-\")","v":"-"},"BC",{"$f":"IF(E16=\"-\",\"-\",(IF(L16<O$12,\"-\",O$12)))","v":"-"},{"$f":"IFERROR(IF(G16,Calculations!AX7,\"-\"),\"-\")","v":"-"},{"$f":"IFERROR(G16*H16/1000,\"-\")","v":"-"},{"$f":"IFERROR(MROUND(IF(G16=$O$12,Calculations!AD7,\"-\"),5),\"-\")","v":"-"},{"$f":"IFERROR(J16/I16,\"-\")","v":"-"},{"$f":"IFERROR(INDEX(MasterTable[],MATCH(A16,MasterTable[PF+CR],0),COLUMN(MasterTable[Max Current])),\"-\")","v":"-"},{"$f":"IFERROR(INDEX(MasterTable[],MATCH(Simulator!E16,MasterTable[P/N],0),COLUMN(MasterTable[Typical Current])),\"-\")","v":"-"},{"$f":"IFERROR(INDEX(MasterTable[],MATCH(Simulator!E16,MasterTable[P/N],0),COLUMN(MasterTable[Typical Lumens])),\"-\")","v":"-"},{"$f":"IFERROR(IF(G16,Calculations!F7,\"-\"),\"-\")","v":"-"}]
["V8-AH-40G",null,null,"V8",{"$f":"IFERROR(INDEX(MasterTable[],MATCH(A17,MasterTable[PF+CR],0),7),\"-\")","v":"-"},"AH","-",{"$f":"IFERROR(IF(G17,Calculations!AX8,\"-\"),\"-\")","v":"-"},"-",{"$f":"IFERROR(MROUND(IF(G17=$O$12,Calculations!AD8,\"-\"),5),\"-\")","v":"-"},"-",{"$f":"IFERROR(INDEX(MasterTable[],MATCH(A17,MasterTable[PF+CR],0),COLUMN(MasterTable[Max Current])),\"-\")","v":"-"},{"$f":"IFERROR(INDEX(MasterTable[],MATCH(Simulator!E17,MasterTable[P/N],0),COLUMN(MasterTable[Typical Current])),\"-\")","v":"-"},{"$f":"IFERROR(INDEX(MasterTable[],MATCH(Simulator!E17,MasterTable[P/N],0),COLUMN(MasterTable[Typical Lumens])),\"-\")","v":"-"},{"$f":"IFERROR(IF(G17,Calculations!F8,\"-\"),\"-\")","v":"-"}]
["V8-AL-40G",null,null,"V8",{"$f":"IFERROR(INDEX(MasterTable[],MATCH(A18,MasterTable[PF+CR],0),7),\"-\")","v":"BXRE-40G0800-A-2x"},"AL",200,{"$f":"IFERROR(IF(G18,Calculations!AX9,\"-\"),\"-\")","v":36.068000000000005},7.2136000000000013,{"$f":"IFERROR(MROUND(IF(G18=$O$12,Calculations!AD9,\"-\"),5),\"-\")","v":800},110.90163025396471,{"$f":"IFERROR(INDEX(MasterTable[],MATCH(A18,MasterTable[PF+CR],0),COLUMN(MasterTable[Max Current])),\"-\")","v":350},{"$f":"IFERROR(INDEX(MasterTable[],MATCH(Simulator!E18,MasterTable[P/N],0),COLUMN(MasterTable[Typical Current])),\"-\")","v":175},{"$f":"IFERROR(INDEX(MasterTable[],MATCH(Simulator!E18,MasterTable[P/N],0),COLUMN(MasterTable[Typical Lumens])),\"-\")","v":716},{"$f":"IFERROR(IF(G18,Calculations!F9,\"-\"),\"-\")","v":30.121656000000002}]
["V8-BF-40G",null,null,"V8",{"$f":"IFERROR(INDEX(MasterTable[],MATCH(A19,MasterTable[PF+CR],0),7),\"-\")","v":"BXRE-40G0800-B-2x"},"BF",200,{"$f":"IFERROR(IF(G19,Calculations!AX10,\"-\"),\"-\")","v":17.034822408033602},3.4069644816067202,{"$f":"IFERROR(MROUND(IF(G19=$O$12,Calculations!AD10,\"-\"),5),\"-\")","v":430},126.21205836499139,{"$f":"IFERROR(INDEX(MasterTable[],MATCH(A19,MasterTable[PF+CR],0),COLUMN(MasterTable[Max Current])),\"-\")","v":700},{"$f":"IFERROR(INDEX(MasterTable[],MATCH(Simulator!E19,MasterTable[P/N],0),COLUMN(MasterTable[Typical Current])),\"-\")","v":350},{"$f":"IFERROR(INDEX(MasterTable[],MATCH(Simulator!E19,MasterTable[P/N],0),COLUMN(MasterTable[Typical Lumens])),\"-\")","v":716},{"$f":"IFERROR(IF(G19,Calculations!F10,\"-\"),\"-\")","v":27.41894478194077}]
["V10-BI-40G",null,null,"V10",{"$f":"IFERROR(INDEX(MasterTable[],MATCH(A20,MasterTable[PF+CR],0),7),\"-\")","v":"BXRE-40G1000-B-2x"},"BI",200,{"$f":"IFERROR(IF(G20,Calculations!AX11,\"-\"),\"-\")","v":25.239040000000003},5.0478080000000007,{"$f":"IFERROR(MROUND(IF(G20=$O$12,Calculations!AD11,\"-\"),5),\"-\")","v":645},127.77823562227404,{"$f":"IFERROR(INDEX(MasterTable[],MATCH(A20,MasterTable[PF+CR],0),COLUMN(MasterTable[Max Current])),\"-\")","v":700},{"$f":"IFERROR(INDEX(MasterTable[],MATCH(Simulator!E20,MasterTable[P/N],0),COLUMN(MasterTable[Typical Current])),\"-\")","v":350},{"$f":"IFERROR(INDEX(MasterTable[],MATCH(Simulator!E20,MasterTable[P/N],0),COLUMN(MasterTable[Typical Lumens])),\"-\")","v":1076},{"$f":"IFERROR(IF(G20,Calculations!F11,\"-\"),\"-\")","v":27.372469760000001}]
["V13-C-40G",null,null,"V13",{"$f":"IFERROR(INDEX(MasterTable[],MATCH(A21,MasterTable[PF+CR],0),7),\"-\")","v":"BXRE-40G2000-C-2x"},"C",{"$f":"IF(E21=\"-\",\"-\",(IF(L21<O$12,\"-\",O$12)))","v":200},{"$f":"IFERROR(IF(G21,Calculations!AX12,\"-\"),\"-\")","v":30.364212291412969},{"$f":"IFERROR(G21*H21/1000,\"-\")","v":6.0728424582825937},{"$f":"IFERROR(MROUND(IF(G21=$O$12,Calculations!AD12,\"-\"),5),\"-\")","v":820},{"$f":"IFERROR(J21/I21,\"-\")","v":135.02737896347421},{"$f":"IFERROR(INDEX(MasterTable[],MATCH(A21,MasterTable[PF+CR],0),COLUMN(MasterTable[Max Current])),\"-\")","v":1050},{"$f":"IFERROR(INDEX(MasterTable[],MATCH(Simulator!E21,MasterTable[P/N],0),COLUMN(MasterTable[Typical Current])),\"-\")","v":500},{"$f":"IFERROR(INDEX(MasterTable[],MATCH(Simulator!E21,MasterTable[P/N],0),COLUMN(MasterTable[Typical Lumens])),\"-\")","v":1900},{"$f":"IFERROR(IF(G21,Calculations!F12,\"-\"),\"-\")","v":26.336025340822172}]
["V15-DL-40G",null,null,"V15",{"$f":"IFERROR(INDEX(MasterTable[],MATCH(A22,MasterTable[PF+CR],0),7),\"-\")","v":"BXRE-40G3001-D-2x"},"DL",200,{"$f":"IFERROR(IF(G22,Calculations!AX13,\"-\"),\"-\")","v":33.152000000000001},6.6304000000000007,{"$f":"IFERROR(MROUND(IF(G22=$O$12,Calculations!AD13,\"-\"),5),\"-\")","v":885},133.47611003861002,{"$f":"IFERROR(INDEX(MasterTable[],MATCH(A22,MasterTable[PF+CR],0),COLUMN(MasterTable[Max Current])),\"-\")","v":1400},{"$f":"IFERROR(INDEX(MasterTable[],MATCH(Simulator!E22,MasterTable[P/N],0),COLUMN(MasterTable[Typical Current])),\"-\")","v":700},{"$f":"IFERROR(INDEX(MasterTable[],MATCH(Simulator!E22,MasterTable[P/N],0),COLUMN(MasterTable[Typical Lumens])),\"-\")","v":2822},{"$f":"IFERROR(IF(G22,Calculations!F13,\"-\"),\"-\")","v":26.060863999999999}]
["V18-F-40G",null,null,"V18",{"$f":"IFERROR(INDEX(MasterTable[],MATCH(A23,MasterTable[PF+CR],0),7),\"-\")","v":"BXRE-40G4000-F-2x"},"F",200,{"$f":"IFERROR(IF(G23,Calculations!AX14,\"-\"),\"-\")","v":26.718377260536386},{"$f":"IFERROR(G23*H23/1000,\"-\")","v":5.3436754521072771},{"$f":"IFERROR(MROUND(IF(G23=$O$12,Calculations!AD14,\"-\"),5),\"-\")","v":795},{"$f":"IFERROR(J23/I23,\"-\")","v":148.77400529377059},{"$f":"IFERROR(INDEX(MasterTable[],MATCH(A23,MasterTable[PF+CR],0),COLUMN(MasterTable[Max Current])),\"-\")","v":2100},{"$f":"IFERROR(INDEX(MasterTable[],MATCH(Simulator!E23,MasterTable[P/N],0),COLUMN(MasterTable[Typical Current])),\"-\")","v":1050},{"$f":"IFERROR(INDEX(MasterTable[],MATCH(Simulator!E23,MasterTable[P/N],0),COLUMN(MasterTable[Typical Lumens])),\"-\")","v":3670},{"$f":"IFERROR(IF(G23,Calculations!F14,\"-\"),\"-\")","v":25.694677808773946}]
[{"$f":"D24&\"-\"&F24&\"-\"&K$6","v":"V22-G-40G"},null,null,"V22",{"$f":"IFERROR(INDEX(MasterTable[],MATCH(A24,MasterTable[PF+CR],0),7),\"-\")","v":"-"},"G",{"$f":"IF(E24=\"-\",\"-\",(IF(L24<O$12,\"-\",O$12)))","v":"-"},{"$f":"IFERROR(IF(G24,Calculations!AX15,\"-\"),\"-\")","v":"-"},"-",{"$f":"IFERROR(MROUND(IF(G24=$O$12,Calculations!AD15,\"-\"),5),\"-\")","v":"-"},"-",{"$f":"IFERROR(INDEX(MasterTable[],MATCH(A24,MasterTable[PF+CR],0),COLUMN(MasterTable[Max Current])),\"-\")","v":"-"},{"$f":"IFERROR(INDEX(MasterTable[],MATCH(Simulator!E24,MasterTable[P/N],0),COLUMN(MasterTable[Typical Current])),\"-\")","v":"-"},{"$f":"IFERROR(INDEX(MasterTable[],MATCH(Simulator!E24,MasterTable[P/N],0),COLUMN(MasterTable[Typical Lumens])),\"-\")","v":"-"},{"$f":"IFERROR(IF(G24,Calculations!F15,\"-\"),\"-\")","v":"-"}]
[]
[{"$f":"D26&C26&\"-\"&K$6&F26","v":"Vero 10-40GB"},null,null,"Vero 10",{"$f":"IFERROR(INDEX(MasterTable[],MATCH(A26,MasterTable[PF+CR],0),7),\"-\")","v":"BXRC-40G1000-B-2x"},"B",{"$f":"IF(E26=\"-\",\"-\",(IF(L26<O$12,\"-\",O$12)))","v":200},{"$f":"IFERROR(IF(G26,Calculations!AX20,\"-\"),\"-\")","v":25.239040000000003},{"$f":"IFERROR(G26*H26/1000,\"-\")","v":5.0478080000000007},{"$f":"IFERROR(MROUND(IF(G26=$O$12,Calculations!AD20,\"-\"),5),\"-\")","v":645},{"$f":"IFERROR(J26/I26,\"-\")","v":127.77823562227404},{"$f":"IFERROR(INDEX(MasterTable[],MATCH(A26,MasterTable[PF+CR],0),COLUMN(MasterTable[Max Current])),\"-\")","v":700},{"$f":"IFERROR(INDEX(MasterTable[],MATCH(Simulator!E26,MasterTable[P/N],0),COLUMN(MasterTable[Typical Current])),\"-\")","v":350},{"$f":"IFERROR(INDEX(MasterTable[],MATCH(Simulator!E26,MasterTable[P/N],0),COLUMN(MasterTable[Typical Lumens])),\"-\")","v":1076},{"$f":"IFERROR(IF(G26,Calculations!F20,\"-\"),\"-\")","v":27.372469760000001}]
[{"$f":"D27&C27&\"-\"&K$6&F27","v":"Vero 13-40GC"},null,null,"Vero 13",{"$f":"IFERROR(INDEX(MasterTable[],MATCH(A27,MasterTable[PF+CR],0),7),\"-\")","v":"BXRC-40G2000-C-2x"},"C",{"$f":"IF(E27=\"-\",\"-\",(IF(L27<O$12,\"-\",O$12)))","v":200},{"$f":"IFERROR(IF(G27,Calculations!AX21,\"-\"),\"-\")","v":30.364212291412969},{"$f":"IFERROR(G27*H27/1000,\"-\")","v":6.0728424582825937},{"$f":"IFERROR(MROUND(IF(G27=$O$12,Calculations!AD21,\"-\"),5),\"-\")","v":820},{"$f":"IFERROR(J27/I27,\"-\")","v":135.02737896347421},{"$f":"IFERROR(INDEX(MasterTable[],MATCH(A27,MasterTable[PF+CR],0),COLUMN(MasterTable[Max Current])),\"-\")","v":1050},{"$f":"IFERROR(INDEX(MasterTable[],MATCH(Simulator!E27,MasterTable[P/N],0),COLUMN(MasterTable[Typical Current])),\"-\")","v":500},{"$f":"IFERROR(INDEX(MasterTable[],MATCH(Simulator!E27,MasterTable[P/N],0),COLUMN(MasterTable[Typical Lumens])),\"-\")","v":1900},{"$f":"IFERROR(IF(G27,Calculations!F21,\"-\"),\"-\")","v":26.336025340822172}]
[{"$f":"D28&C28&\"-\"&K$6&F28","v":"Vero 18-40GF"},null,null,"Vero 18",{"$f":"IFERROR(INDEX(MasterTable[],MATCH(A28,MasterTable[PF+CR],0),7),\"-\")","v":"BXRC-40G4000-F-2x"},"F",{"$f":"IF(E28=\"-\",\"-\",(IF(L28<O$12,\"-\",O$12)))","v":200},{"$f":"IFERROR(IF(G28,Calculations!AX22,\"-\"),\"-\")","v":26.718377260536386},{"$f":"IFERROR(G28*H28/1000,\"-\")","v":5.3436754521072771},{"$f":"IFERROR(MROUND(IF(G28=$O$12,Calculations!AD22,\"-\"),5),\"-\")","v":795},{"$f":"IFERROR(J28/I28,\"-\")","v":148.77400529377059},{"$f":"IFERROR(INDEX(MasterTable[],MATCH(A28,MasterTable[PF+CR],0),COLUMN(MasterTable[Max Current])),\"-\")","v":2100},{"$f":"IFERROR(INDEX(MasterTable[],MATCH(Simulator!E28,MasterTable[P/N],0),COLUMN(MasterTable[Typical Current])),\"-\")","v":1050},{"$f":"IFERROR(INDEX(MasterTable[],MATCH(Simulator!E28,MasterTable[P/N],0),COLUMN(MasterTable[Typical Lumens])),\"-\")","v":3670},{"$f":"IFERROR(IF(G28,Calculations!F22,\"-\"),\"-\")","v":25.694677808773946}]
[{"$f":"D29&C29&\"-\"&K$6&F29","v":"Vero 29-40GL"},null,null,"Vero 29",{"$f":"IFERROR(INDEX(MasterTable[],MATCH(A29,MasterTable[PF+CR],0),7),\"-\")","v":"BXRC-40G10K0-L-2x"},"L",{"$f":"IF(E29=\"-\",\"-\",(IF(L29<O$12,\"-\",O$12)))","v":200},{"$f":"IFERROR(IF(G29,Calculations!AX23,\"-\"),\"-\")","v":33.66243268928369},{"$f":"IFERROR(G29*H29/1000,\"-\")","v":6.7324865378567385},{"$f":"IFERROR(MROUND(IF(G29=$O$12,Calculations!AD23,\"-\"),5),\"-\")","v":1040},{"$f":"IFERROR(J29/I29,\"-\")","v":154.47487256782247},{"$f":"IFERROR(INDEX(MasterTable[],MATCH(A29,MasterTable[PF+CR],0),COLUMN(MasterTable[Max Current])),\"-\")","v":4200},{"$f":"IFERROR(INDEX(MasterTable[],MATCH(Simulator!E29,MasterTable[P/N],0),COLUMN(MasterTable[Typical Current])),\"-\")","v":2100},{"$f":"IFERROR(INDEX(MasterTable[],MATCH(Simulator!E29,MasterTable[P/N],0),COLUMN(MasterTable[Typical Lumens])),\"-\")","v":9415},{"$f":"IFERROR(IF(G29,Calculations!F23,\"-\"),\"-\")","v":25.403949192271405}]
[]
[{"$f":"D31&C31&\"-\"&K$6&F31","v":"H6-40GC"},null,null,"H6",{"$f":"IFERROR(INDEX(MasterTable[],MATCH(A31,MasterTable[PF+CR],0),7),\"-\")","v":"-"},"C",{"$f":"IF(E31=\"-\",\"-\",(IF(L31<O$12,\"-\",O$12)))","v":"-"},{"$f":"IFERROR(IF(G31,Calculations!AX28,\"-\"),\"-\")","v":"-"},{"$f":"IFERROR(G31*H31/1000,\"-\")","v":"-"},{"$f":"IFERROR(MROUND(IF(G31=$O$12,Calculations!AD28,\"-\"),5),\"-\")","v":"-"},{"$f":"IFERROR(J31/I31,\"-\")","v":"-"},{"$f":"IFERROR(INDEX(MasterTable[],MATCH(A31,MasterTable[PF+CR],0),COLUMN(MasterTable[Max Current])),\"-\")","v":"-"},{"$f":"IFERROR(INDEX(MasterTable[],MATCH(Simulator!E31,MasterTable[P/N],0),COLUMN(MasterTable[Typical Current])),\"-\")","v":"-"},{"$f":"IFERROR(INDEX(MasterTable[],MATCH(Simulator!E31,MasterTable[P/N],0),COLUMN(MasterTable[Typical Lumens])),\"-\")","v":"-"},{"$f":"IFERROR(IF(G31,Calculations!F28,\"-\"),\"-\")","v":"-"}]
[{"$f":"D32&C32&\"-\"&K$6&F32","v":"H9-40GD"},null,null,"H9",{"$f":"IFERROR(INDEX(MasterTable[],MATCH(A32,MasterTable[PF+CR],0),7),\"-\")","v":"-"},"D",{"$f":"IF(E32=\"-\",\"-\",(IF(L32<O$12,\"-\",O$12)))","v":"-"},{"$f":"IFERROR(IF(G32,Calculations!AX29,\"-\"),\"-\")","v":"-"},{"$f":"IFERROR(G32*H32/1000,\"-\")","v":"-"},{"$f":"IFERROR(MROUND(IF(G32=$O$12,Calculations!AD29,\"-\"),5),\"-\")","v":"-"},{"$f":"IFERROR(J32/I32,\"-\")","v":"-"},{"$f":"IFERROR(INDEX(MasterTable[],MATCH(A32,MasterTable[PF+CR],0),COLUMN(MasterTable[Max Current])),\"-\")","v":"-"},{"$f":"IFERROR(INDEX(MasterTable[],MATCH(Simulator!E32,MasterTable[P/N],0),COLUMN(MasterTable[Typical Current])),\"-\")","v":"-"},{"$f":"IFERROR(INDEX(MasterTable[],MATCH(Simulator!E32,MasterTable[P/N],0),COLUMN(MasterTable[Typical Lumens])),\"-\")","v":"-"},{"$f":"IFERROR(IF(G32,Calculations!F29,\"-\"),\"-\")","v":"-"}]
["H12-40GG",null,null,"H12",{"$f":"IFERROR(INDEX(MasterTable[],MATCH(A33,MasterTable[PF+CR],0),7),\"-\")","v":"-"},"G",{"$f":"IF(E33=\"-\",\"-\",(IF(L33<O$12,\"-\",O$12)))","v":"-"},{"$f":"IFERROR(IF(G33,Calculations!AX30,\"-\"),\"-\")","v":"-"},{"$f":"IFERROR(G33*H33/1000,\"-\")","v":"-"},{"$f":"IFERROR(MROUND(IF(G33=$O$12,Calculations!AD30,\"-\"),5),\"-\")","v":"-"},{"$f":"IFERROR(J33/I33,\"-\")","v":"-"},{"$f":"IFERROR(INDEX(MasterTable[],MATCH(A33,MasterTable[PF+CR],0),COLUMN(MasterTable[Max Current])),\"-\")","v":"-"},{"$f":"IFERROR(INDEX(MasterTable[],MATCH(Simulator!E33,MasterTable[P/N],0),COLUMN(MasterTable[Typical Current])),\"-\")","v":"-"},{"$f":"IFERROR(INDEX(MasterTable[],MATCH(Simulator!E33,MasterTable[P/N],0),COLUMN(MasterTable[Typical Lumens])),\"-\")","v":"-"},{"$f":"IFERROR(IF(G33,Calculations!F30,\"-\"),\"-\")","v":"-"}]
["H15-40GJ",null,null,"H15",{"$f":"IFERROR(INDEX(MasterTable[],MATCH(A34,MasterTable[PF+CR],0),7),\"-\")","v":"-"},"J","-",{"$f":"IFERROR(IF(G34,Calculations!AX31,\"-\"),\"-\")","v":"-"},"-",{"$f":"IFERROR(MROUND(IF(G34=$O$12,Calculations!AD31,\"-\"),5),\"-\")","v":"-"},"-",{"$f":"IFERROR(INDEX(MasterTable[],MATCH(A34,MasterTable[PF+CR],0),COLUMN(MasterTable[Max Current])),\"-\")","v":"-"},{"$f":"IFERROR(INDEX(MasterTable[],MATCH(Simulator!E34,MasterTable[P/N],0),COLUMN(MasterTable[Typical Current])),\"-\")","v":"-"},{"$f":"IFERROR(INDEX(MasterTable[],MATCH(Simulator!E34,MasterTable[P/N],0),COLUMN(MasterTable[Typical Lumens])),\"-\")","v":"-"},{"$f":"IFERROR(IF(G34,Calculations!F31,\"-\"),\"-\")","v":"-"}]
[]
[]
[null,null,null,"Drive Current Needed for Required Lumens",null,null,null,null,null,null,null,null,null,null,"Section 3"]
[null,null,null,"Calculate drive current required for chosen lumen output",null,null,null,null,null,null,null,null,null,"ENTER REQUIRED LUMENS:",40]
[null,null,null,"V Series & Vero Series",null,null,null,null,null,null,null,null,null,null,null,null,null,"Efficacy (lm/W)"]
[null,null,null,"Use this table for new projects"]
[null,null,null,{"$f":"D14","v":"Product"},{"$f":"E14","v":"Part Number"},"Config",{"$f":"G14","v":"Drive\nCurrent\n(mA)"},"Voltage\n(V)","Power\n(W)","Lumen @ \nCase = 25°C","Efficacy @ \nCase = 25°C","Max Drive\nCurrent\n(mA)","Typical\n Current\n (mA)","Typical \nLumens","Tj\n (°C)"]
[{"$f":"D42&\"-\"&F42&\"-\"&K$6","v":"V6-AF-40G"},null,null,"V6",{"$f":"IFERROR(INDEX(MasterTable[],MATCH(A42,MasterTable[PF+CR],0),7),\"-\")","v":"-"},"AF",{"$f":"IFERROR(MROUND(IF(OR(E42=\"-\",Calculations!V36>(L42+1)),\"-\",Calculations!V36),5),\"-\")","v":"-"},{"$f":"IFERROR(IF(G42,Calculations!AX36,\"-\"),\"-\")","v":"-"},{"$f":"IFERROR(G42*H42/1000,\"-\")","v":"-"},{"$f":"IFERROR(MROUND(IF(G42,Calculations!AC36*N42,\"-\"),5),\"-\")","v":"-"},{"$f":"IFERROR(J42/I42,\"-\")","v":"-"},{"$f":"IFERROR(INDEX(MasterTable[],MATCH(A42,MasterTable[PF+CR],0),COLUMN(MasterTable[Max Current])),\"-\")","v":"-"},{"$f":"IFERROR(INDEX(MasterTable[],MATCH(Simulator!E42,MasterTable[P/N],0),COLUMN(MasterTable[Typical Current])),\"-\")","v":"-"},{"$f":"IFERROR(INDEX(MasterTable[],MATCH(Simulator!E42,MasterTable[P/N],0),COLUMN(MasterTable[Typical Lumens])),\"-\")","v":"-"},{"$f":"IFERROR(IF(G42,Calculations!F36,\"-\"),\"-\")","v":"-"}]
[{"$f":"D43&\"-\"&F43&\"-\"&K$6","v":"V6-BC-40G"},null,null,"V6",{"$f":"IFERROR(INDEX(MasterTable[],MATCH(A43,MasterTable[PF+CR],0),7),\"-\")","v":"-"},"BC",{"$f":"IFERROR(MROUND(IF(OR(E43=\"-\",Calculations!V37>(L43+1)),\"-\",Calculations!V37),5),\"-\")","v":"-"},{"$f":"IFERROR(IF(G43,Calculations!AX37,\"-\"),\"-\")","v":"-"},{"$f":"IFERROR(G43*H43/1000,\"-\")","v":"-"},{"$f":"IFERROR(MROUND(IF(G43,Calculations!AC37*N43,\"-\"),5),\"-\")","v":"-"},{"$f":"IFERROR(J43/I43,\"-\")","v":"-"},{"$f":"IFERROR(INDEX(MasterTable[],MATCH(A43,MasterTable[PF+CR],0),COLUMN(MasterTable[Max Current])),\"-\")","v":"-"},{"$f":"IFERROR(INDEX(MasterTable[],MATCH(Simulator!E43,MasterTable[P/N],0),COLUMN(MasterTable[Typical Current])),\"-\")","v":"-"},{"$f":"IFERROR(INDEX(MasterTable[],MATCH(Simulator!E43,MasterTable[P/N],0),COLUMN(MasterTable[Typical Lumens])),\"-\")","v":"-"},{"$f":"IFERROR(IF(G43,Calculations!F37,\"-\"),\"-\")","v":"-"}]
["V8-AH-40G",null,null,"V8",{"$f":"IFERROR(INDEX(MasterTable[],MATCH(A44,MasterTable[PF+CR],0),7),\"-\")","v":"-"},"AH",{"$f":"IFERROR(MROUND(IF(OR(E44=\"-\",Calculations!V38>(L44+1)),\"-\",Calculations!V38),5),\"-\")","v":"-"},{"$f":"IFERROR(IF(G44,Calculations!AX38,\"-\"),\"-\")","v":"-"},"-",{"$f":"IFERROR(MROUND(IF(G44,Calculations!AC38*N44,\"-\"),5),\"-\")","v":"-"},"-",{"$f":"IFERROR(INDEX(MasterTable[],MATCH(A44,MasterTable[PF+CR],0),COLUMN(MasterTable[Max Current])),\"-\")","v":"-"},{"$f":"IFERROR(INDEX(MasterTable[],MATCH(Simulator!E44,MasterTable[P/N],0),COLUMN(MasterTable[Typical Current])),\"-\")","v":"-"},{"$f":"IFERROR(INDEX(MasterTable[],MATCH(Simulator!E44,MasterTable[P/N],0),COLUMN(MasterTable[Typical Lumens])),\"-\")","v":"-"},{"$f":"IFERROR(IF(G44,Calculations!F38,\"-\"),\"-\")","v":"-"}]
["V8-AL-40G",null,null,"V8",{"$f":"IFERROR(INDEX(MasterTable[],MATCH(A45,MasterTable[PF+CR],0),7),\"-\")","v":"BXRE-40G0800-A-2x"},"AL",{"$f":"IFERROR(MROUND(IF(OR(E45=\"-\",Calculations!V39>(L45+1)),\"-\",Calculations!V39),5),\"-\")","v":10},{"$f":"IFERROR(IF(G45,Calculations!AX39,\"-\"),\"-\")","v":35.6},0.35599999999999998,{"$f":"IFERROR(MROUND(IF(G45,Calculations!AC39*N45,\"-\"),5),\"-\")","v":40},112.35955056179776,{"$f":"IFERROR(INDEX(MasterTable[],MATCH(A45,MasterTable[PF+CR],0),COLUMN(MasterTable[Max Current])),\"-\")","v":350},{"$f":"IFERROR(INDEX(MasterTable[],MATCH(Simulator!E45,MasterTable[P/N],0),COLUMN(MasterTable[Typical Current])),\"-\")","v":175},{"$f":"IFERROR(INDEX(MasterTable[],MATCH(Simulator!E45,MasterTable[P/N],0),COLUMN(MasterTable[Typical Lumens])),\"-\")","v":716},{"$f":"IFERROR(IF(G45,Calculations!F39,\"-\"),\"-\")","v":25.220140119774634}]
["V8-BF-40G",null,null,"V8",{"$f":"IFERROR(INDEX(MasterTable[],MATCH(A46,MasterTable[PF+CR],0),7),\"-\")","v":"BXRE-40G0800-B-2x"},"BF",{"$f":"IFERROR(MROUND(IF(OR(E46=\"-\",Calculations!V40>(L46+1)),\"-\",Calculations!V40),5),\"-\")","v":15},{"$f":"IFERROR(IF(G46,Calculations!AX40,\"-\"),\"-\")","v":17.8},0.26700000000000002,{"$f":"IFERROR(MROUND(IF(G46,Calculations!AC40*N46,\"-\"),5),\"-\")","v":40},149.81273408239699,{"$f":"IFERROR(INDEX(MasterTable[],MATCH(A46,MasterTable[PF+CR],0),COLUMN(MasterTable[Max Current])),\"-\")","v":700},{"$f":"IFERROR(INDEX(MasterTable[],MATCH(Simulator!E46,MasterTable[P/N],0),COLUMN(MasterTable[Typical Current])),\"-\")","v":350},{"$f":"IFERROR(INDEX(MasterTable[],MATCH(Simulator!E46,MasterTable[P/N],0),COLUMN(MasterTable[Typical Lumens])),\"-\")","v":716},{"$f":"IFERROR(IF(G46,Calculations!F40,\"-\"),\"-\")","v":25.165425350801062}]
["V10-BI-40G",null,null,"V10",{"$f":"IFERROR(INDEX(MasterTable[],MATCH(A47,MasterTable[PF+CR],0),7),\"-\")","v":"BXRE-40G1000-B-2x"},"BI",{"$f":"IFERROR(MROUND(IF(OR(E47=\"-\",Calculations!V41>(L47+1)),\"-\",Calculations!V41),5),\"-\")","v":10},{"$f":"IFERROR(IF(G47,Calculations!AX41,\"-\"),\"-\")","v":26.5},0.26500000000000001,{"$f":"IFERROR(MROUND(IF(G47,Calculations!AC41*N47,\"-\"),5),\"-\")","v":40},150.94339622641508,{"$f":"IFERROR(INDEX(MasterTable[],MATCH(A47,MasterTable[PF+CR],0),COLUMN(MasterTable[Max Current])),\"-\")","v":700},{"$f":"IFERROR(INDEX(MasterTable[],MATCH(Simulator!E47,MasterTable[P/N],0),COLUMN(MasterTable[Typical Current])),\"-\")","v":350},{"$f":"IFERROR(INDEX(MasterTable[],MATCH(Simulator!E47,MasterTable[P/N],0),COLUMN(MasterTable[Typical Lumens])),\"-\")","v":1076},{"$f":"IFERROR(IF(G47,Calculations!F41,\"-\"),\"-\")","v":25.107656712883802}]
["V13-C-40G",null,null,"V13",{"$f":"IFERROR(INDEX(MasterTable[],MATCH(A48,MasterTable[PF+CR],0),7),\"-\")","v":"BXRE-40G2000-C-2x"},"C",{"$f":"IFERROR(MROUND(IF(OR(E48=\"-\",Calculations!V42>(L48+1)),\"-\",Calculations!V42),5),\"-\")","v":5},{"$f":"IFERROR(IF(G48,Calculations!AX42,\"-\"),\"-\")","v":32.300000000000004},{"$f":"IFERROR(G48*H48/1000,\"-\")","v":0.16150000000000003},{"$f":"IFERROR(MROUND(IF(G48,Calculations!AC42*N48,\"-\"),5),\"-\")","v":40},{"$f":"IFERROR(J48/I48,\"-\")","v":247.67801857585135},{"$f":"IFERROR(INDEX(MasterTable[],MATCH(A48,MasterTable[PF+CR],0),COLUMN(MasterTable[Max Current])),\"-\")","v":1050},{"$f":"IFERROR(INDEX(MasterTable[],MATCH(Simulator!E48,MasterTable[P/N],0),COLUMN(MasterTable[Typical Current])),\"-\")","v":500},{"$f":"IFERROR(INDEX(MasterTable[],MATCH(Simulator!E48,MasterTable[P/N],0),COLUMN(MasterTable[Typical Lumens])),\"-\")","v":1900},{"$f":"IFERROR(IF(G48,Calculations!F42,\"-\"),\"-\")","v":25.031046415044546}]
["V15-DL-40G",null,null,"V15",{"$f":"IFERROR(INDEX(MasterTable[],MATCH(A49,MasterTable[PF+CR],0),7),\"-\")","v":"BXRE-40G3001-D-2x"},"DL",{"$f":"IFERROR(MROUND(IF(OR(E49=\"-\",Calculations!V43>(L49+1)),\"-\",Calculations!V43),5),\"-\")","v":10},{"$f":"IFERROR(IF(G49,Calculations!AX43,\"-\"),\"-\")","v":36},0.36,{"$f":"IFERROR(MROUND(IF(G49,Calculations!AC43*N49,\"-\"),5),\"-\")","v":40},111.11111111111111,{"$f":"IFERROR(INDEX(MasterTable[],MATCH(A49,MasterTable[PF+CR],0),COLUMN(MasterTable[Max Current])),\"-\")","v":1400},{"$f":"IFERROR(INDEX(MasterTable[],MATCH(Simulator!E49,MasterTable[P/N],0),COLUMN(MasterTable[Typical Current])),\"-\")","v":700},{"$f":"IFERROR(INDEX(MasterTable[],MATCH(Simulator!E49,MasterTable[P/N],0),COLUMN(MasterTable[Typical Lumens])),\"-\")","v":2822},{"$f":"IFERROR(IF(G49,Calculations!F43,\"-\"),\"-\")","v":25.050084708679524}]
["V18-F-40G",null,null,"V18",{"$f":"IFERROR(INDEX(MasterTable[],MATCH(A50,MasterTable[PF+CR],0),7),\"-\")","v":"BXRE-40G4000-F-2x"},"F",{"$f":"IFERROR(MROUND(IF(OR(E50=\"-\",Calculations!V44>(L50+1)),\"-\",Calculations!V44),5),\"-\")","v":5},{"$f":"IFERROR(IF(G50,Calculations!AX44,\"-\"),\"-\")","v":29.5},0.14749999999999999,{"$f":"IFERROR(MROUND(IF(G50,Calculations!AC44*N50,\"-\"),5),\"-\")","v":40},271.18644067796612,{"$f":"IFERROR(INDEX(MasterTable[],MATCH(A50,MasterTable[PF+CR],0),COLUMN(MasterTable[Max Current])),\"-\")","v":2100},{"$f":"IFERROR(INDEX(MasterTable[],MATCH(Simulator!E50,MasterTable[P/N],0),COLUMN(MasterTable[Typical Current])),\"-\")","v":1050},{"$f":"IFERROR(INDEX(MasterTable[],MATCH(Simulator!E50,MasterTable[P/N],0),COLUMN(MasterTable[Typical Lumens])),\"-\")","v":3670},{"$f":"IFERROR(IF(G50,Calculations!F44,\"-\"),\"-\")","v":25.016617237666541}]
[{"$f":"D51&\"-\"&F51&\"-\"&K$6","v":"V22-G-40G"},null,null,"V22",{"$f":"IFERROR(INDEX(MasterTable[],MATCH(A51,MasterTable[PF+CR],0),7),\"-\")","v":"-"},"G",{"$f":"IFERROR(MROUND(IF(OR(E51=\"-\",Calculations!V45>(L51+1)),\"-\",Calculations!V45),5),\"-\")","v":"-"},{"$f":"IFERROR(IF(G51,Calculations!AX45,\"-\"),\"-\")","v":"-"},{"$f":"IFERROR(G51*H51/1000,\"-\")","v":"-"},{"$f":"IFERROR(MROUND(IF(G51,Calculations!AC45*N51,\"-\"),5),\"-\")","v":"-"},{"$f":"IFERROR(J51/I51,\"-\")","v":"-"},{"$f":"IFERROR(INDEX(MasterTable[],MATCH(A51,MasterTable[PF+CR],0),COLUMN(MasterTable[Max Current])),\"-\")","v":"-"},{"$f":"IFERROR(INDEX(MasterTable[],MATCH(Simulator!E51,MasterTable[P/N],0),COLUMN(MasterTable[Typical Current])),\"-\")","v":"-"},{"$f":"IFERROR(INDEX(MasterTable[],MATCH(Simulator!E51,MasterTable[P/N],0),COLUMN(MasterTable[Typical Lumens])),\"-\")","v":"-"},{"$f":"IFERROR(IF(G51,Calculations!F45,\"-\"),\"-\")","v":"-"}]
[]
[{"$f":"A26","v":"Vero 10-40GB"},null,null,"Vero 10",{"$f":"IFERROR(INDEX(MasterTable[],MATCH(A53,MasterTable[PF+CR],0),7),\"-\")","v":"BXRC-40G1000-B-2x"},"B",{"$f":"IFERROR(MROUND(IF(Calculations!V50>(L53+1),\"-\",Calculations!V50),5),\"-\")","v":10},{"$f":"IFERROR(IF(G53,Calculations!AX50,\"-\"),\"-\")","v":26.5},{"$f":"IFERROR(G53*H53/1000,\"-\")","v":0.26500000000000001},{"$f":"IFERROR(MROUND(IF(G53,Calculations!AC50*N53,\"-\"),5),\"-\")","v":40},{"$f":"IFERROR(J53/I53,\"-\")","v":150.94339622641508},{"$f":"IFERROR(INDEX(MasterTable[],MATCH(A53,MasterTable[PF+CR],0),COLUMN(MasterTable[Max Current])),\"-\")","v":700},{"$f":"IFERROR(INDEX(MasterTable[],MATCH(Simulator!E53,MasterTable[P/N],0),COLUMN(MasterTable[Typical Current])),\"-\")","v":350},{"$f":"IFERROR(INDEX(MasterTable[],MATCH(Simulator!E53,MasterTable[P/N],0),COLUMN(MasterTable[Typical Lumens])),\"-\")","v":1076},{"$f":"IFERROR(IF(G53,Calculations!F50,\"-\"),\"-\")","v":25.107649533966796}]
[{"$f":"A27","v":"Vero 13-40GC"},null,null,"Vero 13",{"$f":"IFERROR(INDEX(MasterTable[],MATCH(A54,MasterTable[PF+CR],0),7),\"-\")","v":"BXRC-40G2000-C-2x"},"C",{"$f":"IFERROR(MROUND(IF(Calculations!V51>(L54+1),\"-\",Calculations!V51),5),\"-\")","v":5},{"$f":"IFERROR(IF(G54,Calculations!AX51,\"-\"),\"-\")","v":32.300000000000004},{"$f":"IFERROR(G54*H54/1000,\"-\")","v":0.16150000000000003},{"$f":"IFERROR(MROUND(IF(G54,Calculations!AC51*N54,\"-\"),5),\"-\")","v":40},{"$f":"IFERROR(J54/I54,\"-\")","v":247.67801857585135},{"$f":"IFERROR(INDEX(MasterTable[],MATCH(A54,MasterTable[PF+CR],0),COLUMN(MasterTable[Max Current])),\"-\")","v":1050},{"$f":"IFERROR(INDEX(MasterTable[],MATCH(Simulator!E54,MasterTable[P/N],0),COLUMN(MasterTable[Typical Current])),\"-\")","v":500},{"$f":"IFERROR(INDEX(MasterTable[],MATCH(Simulator!E54,MasterTable[P/N],0),COLUMN(MasterTable[Typical Lumens])),\"-\")","v":1900},{"$f":"IFERROR(IF(G54,Calculations!F51,\"-\"),\"-\")","v":25.031046415044546}]
[{"$f":"A28","v":"Vero 18-40GF"},null,null,"Vero 18",{"$f":"IFERROR(INDEX(MasterTable[],MATCH(A55,MasterTable[PF+CR],0),7),\"-\")","v":"BXRC-40G4000-F-2x"},"F",{"$f":"IFERROR(MROUND(IF(Calculations!V52>(L55+1),\"-\",Calculations!V52),5),\"-\")","v":5},{"$f":"IFERROR(IF(G55,Calculations!AX52,\"-\"),\"-\")","v":29.5},{"$f":"IFERROR(G55*H55/1000,\"-\")","v":0.14749999999999999},{"$f":"IFERROR(MROUND(IF(G55,Calculations!AC52*N55,\"-\"),5),\"-\")","v":40},{"$f":"IFERROR(J55/I55,\"-\")","v":271.18644067796612},{"$f":"IFERROR(INDEX(MasterTable[],MATCH(A55,MasterTable[PF+CR],0),COLUMN(MasterTable[Max Current])),\"-\")","v":2100},{"$f":"IFERROR(INDEX(MasterTable[],MATCH(Simulator!E55,MasterTable[P/N],0),COLUMN(MasterTable[Typical Current])),\"-\")","v":1050},{"$f":"IFERROR(INDEX(MasterTable[],MATCH(Simulator!E55,MasterTable[P/N],0),COLUMN(MasterTable[Typical Lumens])),\"-\")","v":3670},{"$f":"IFERROR(IF(G55,Calculations!F52,\"-\"),\"-\")","v":25.016617237666541}]
[{"$f":"A29","v":"Vero 29-40GL"},null,null,"Vero 29",{"$f":"IFERROR(INDEX(MasterTable[],MATCH(A56,MasterTable[PF+CR],0),7),\"-\")","v":"BXRC-40G10K0-L-2x"},"L",{"$f":"IFERROR(MROUND(IF(Calculations!V53>(L56+1),\"-\",Calculations!V53),5),\"-\")","v":10},{"$f":"IFERROR(IF(G56,Calculations!AX53,\"-\"),\"-\")","v":38},{"$f":"IFERROR(G56*H56/1000,\"-\")","v":0.38},{"$f":"IFERROR(MROUND(IF(G56,Calculations!AC53*N56,\"-\"),5),\"-\")","v":40},{"$f":"IFERROR(J56/I56,\"-\")","v":105.26315789473684},{"$f":"IFERROR(INDEX(MasterTable[],MATCH(A56,MasterTable[PF+CR],0),COLUMN(MasterTable[Max Current])),\"-\")","v":4200},{"$f":"IFERROR(INDEX(MasterTable[],MATCH(Simulator!E56,MasterTable[P/N],0),COLUMN(MasterTable[Typical Current])),\"-\")","v":2100},{"$f":"IFERROR(INDEX(MasterTable[],MATCH(Simulator!E56,MasterTable[P/N],0),COLUMN(MasterTable[Typical Lumens])),\"-\")","v":9415},{"$f":"IFERROR(IF(G56,Calculations!F53,\"-\"),\"-\")","v":25.019703076794976}]
[]
[{"$f":"A31","v":"H6-40GC"},null,null,"H6",{"$f":"IFERROR(INDEX(MasterTable[],MATCH(A58,MasterTable[PF+CR],0),7),\"-\")","v":"-"},"C",{"$f":"IFERROR(MROUND(IF(Calculations!V58>(L58+1),\"-\",Calculations!V58),5),\"-\")","v":"-"},{"$f":"IFERROR(IF(G58,Calculations!AX58,\"-\"),\"-\")","v":"-"},{"$f":"IFERROR(G58*H58/1000,\"-\")","v":"-"},{"$f":"IFERROR(MROUND(IF(G58,Calculations!AC58*N58,\"-\"),5),\"-\")","v":"-"},{"$f":"IFERROR(J58/I58,\"-\")","v":"-"},{"$f":"IFERROR(INDEX(MasterTable[],MATCH(A58,MasterTable[PF+CR],0),COLUMN(MasterTable[Max Current])),\"-\")","v":"-"},{"$f":"IFERROR(INDEX(MasterTable[],MATCH(Simulator!E58,MasterTable[P/N],0),COLUMN(MasterTable[Typical Current])),\"-\")","v":"-"},{"$f":"IFERROR(INDEX(MasterTable[],MATCH(Simulator!E58,MasterTable[P/N],0),COLUMN(MasterTable[Typical Lumens])),\"-\")","v":"-"},{"$f":"IFERROR(IF(G58,Calculations!F58,\"-\"),\"-\")","v":"-"}]
[{"$f":"A32","v":"H9-40GD"},null,null,"H9",{"$f":"IFERROR(INDEX(MasterTable[],MATCH(A59,MasterTable[PF+CR],0),7),\"-\")","v":"-"},"D",{"$f":"IFERROR(MROUND(IF(Calculations!V59>(L59+1),\"-\",Calculations!V59),5),\"-\")","v":"-"},{"$f":"IFERROR(IF(G59,Calculations!AX59,\"-\"),\"-\")","v":"-"},"-",{"$f":"IFERROR(MROUND(IF(G59,Calculations!AC59*N59,\"-\"),5),\"-\")","v":"-"},"-",{"$f":"IFERROR(INDEX(MasterTable[],MATCH(A59,MasterTable[PF+CR],0),COLUMN(MasterTable[Max Current])),\"-\")","v":"-"},{"$f":"IFERROR(INDEX(MasterTable[],MATCH(Simulator!E59,MasterTable[P/N],0),COLUMN(MasterTable[Typical Current])),\"-\")","v":"-"},{"$f":"IFERROR(INDEX(MasterTable[],MATCH(Simulator!E59,MasterTable[P/N],0),COLUMN(MasterTable[Typical Lumens])),\"-\")","v":"-"},{"$f":"IFERROR(IF(G59,Calculations!F59,\"-\"),\"-\")","v":"-"}]
[{"$f":"A33","v":"H12-40GG"},null,null,"H12",{"$f":"IFERROR(INDEX(MasterTable[],MATCH(A60,MasterTable[PF+CR],0),7),\"-\")","v":"-"},"G",{"$f":"IFERROR(MROUND(IF(Calculations!V60>(L60+1),\"-\",Calculations!V60),5),\"-\")","v":"-"},{"$f":"IFERROR(IF(G60,Calculations!AX60,\"-\"),\"-\")","v":"-"},{"$f":"IFERROR(G60*H60/1000,\"-\")","v":"-"},{"$f":"IFERROR(MROUND(IF(G60,Calculations!AC60*N60,\"-\"),5),\"-\")","v":"-"},{"$f":"IFERROR(J60/I60,\"-\")","v":"-"},{"$f":"IFERROR(INDEX(MasterTable[],MATCH(A60,MasterTable[PF+CR],0),COLUMN(MasterTable[Max Current])),\"-\")","v":"-"},{"$f":"IFERROR(INDEX(MasterTable[],MATCH(Simulator!E60,MasterTable[P/N],0),COLUMN(MasterTable[Typical Current])),\"-\")","v":"-"},{"$f":"IFERROR(INDEX(MasterTable[],MATCH(Simulator!E60,MasterTable[P/N],0),COLUMN(MasterTable[Typical Lumens])),\"-\")","v":"-"},{"$f":"IFERROR(IF(G60,Calculations!F60,\"-\"),\"-\")","v":"-"}]
["H15-40GJ",null,null,"H15",{"$f":"IFERROR(INDEX(MasterTable[],MATCH(A61,MasterTable[PF+CR],0),7),\"-\")","v":"-"},"J",{"$f":"IFERROR(MROUND(IF(Calculations!V61>(L61+1),\"-\",Calculations!V61),5),\"-\")","v":"-"},{"$f":"IFERROR(IF(G61,Calculations!AX61,\"-\"),\"-\")","v":"-"},"-",{"$f":"IFERROR(MROUND(IF(G61,Calculations!AC61*N61,\"-\"),5),\"-\")","v":"-"},"-",{"$f":"IFERROR(INDEX(MasterTable[],MATCH(A61,MasterTable[PF+CR],0),COLUMN(MasterTable[Max Current])),\"-\")","v":"-"},{"$f":"IFERROR(INDEX(MasterTable[],MATCH(Simulator!E61,MasterTable[P/N],0),COLUMN(MasterTable[Typical Current])),\"-\")","v":"-"},{"$f":"IFERROR(INDEX(MasterTable[],MATCH(Simulator!E61,MasterTable[P/N],0),COLUMN(MasterTable[Typical Lumens])),\"-\")","v":"-"},{"$f":"IFERROR(IF(G61,Calculations!F61,\"-\"),\"-\")","v":"-"}]
[]
[]
[null,null,"\n© 2014 Bridgelux, Inc."]

{"sheet":"Calculations","index":2,"n_rows":73,"n_cols":50,"rows_kept":73,"cut":false,"hidden":true,"merged":[[56,38,56,41],[54,0,60,0],[55,2,55,5],[55,7,55,10],[55,16,55,28],[55,31,55,43],[55,46,55,48],[54,2,54,5],[54,7,54,10],[54,16,54,28],[54,31,54,43],[54,46,54,48],[24,46,24,48],[25,2,25,5],[25,7,25,10],[25,16,25,28],[25,31,25,43],[25,46,25,48],[24,0,30,0],[24,2,24,5],[24,7,24,10],[24,16,24,28],[24,31,24,43],[26,17,26,20],[26,23,26,26],[26,33,26,36],[26,38,26,41],[46,0,52,0],[18,23,18,26],[46,2,46,5],[46,7,46,10],[46,16,46,28],[48,23,48,26],[32,0,42,0],[32,2,32,5],[32,7,32,10],[32,16,32,28],[33,2,33,5],[33,7,33,10],[33,16,33,28],[47,2,47,5],[47,7,47,10],[47,16,47,28],[2,46,2,48],[18,38,18,41],[16,46,16,48],[2,0,12,0],[4,17,4,20],[16,0,22,0],[16,2,16,5],[16,7,16,10],[17,2,17,5],[17,7,17,10],[17,46,17,48],[18,17,18,20],[17,31,17,43],[18,33,18,36],[3,46,3,48],[16,16,16,28],[34,33,34,36],[34,38,34,41],[16,31,16,43],[17,16,17,28],[62,17,62,19],[32,31,32,43],[33,31,33,43],[34,17,34,20],[48,17,48,20],[48,38,48,41],[47,31,47,43],[46,31,46,43],[48,33,48,36],[56,17,56,20],[56,23,56,26],[56,33,56,36],[46,46,46,48],[47,46,47,48],[2,2,2,5],[2,7,2,10],[2,16,2,28],[2,31,2,43],[4,23,4,26],[4,33,4,36],[4,38,4,41],[3,2,3,5],[3,7,3,10],[3,16,3,28],[3,31,3,43],[32,46,32,48],[33,46,33,48],[34,23,34,26]]}
[]
[]
["Calculations using Current Input",null,"Converting Tc to Tj",null,null,null,null,"Converting Tj to Tc",null,null,null,null,null,null,null,null,"Calculating Flux",null,null,null,null,null,null,null,null,null,null,null,null,null,null,"Calculating Voltage w/ Tc",null,null,null,null,null,null,null,null,null,null,null,null,null,null,"Calculating Voltage w/ Tj"]
[null,null,"Tj = Tc + Power*Thermal Resistance",null,null,null,null,"Tc = Tj - Power*Thermal Resistance",null,null,null,null,null,null,null,null,"F@Tc&I = Ft*Fr@I*Fr@Tc",null,null,null,null,null,null,null,null,null,null,null,null,null,null,"Vf@Tc&I = Vf@I + Vf@Tc-Vft",null,null,null,null,null,null,null,null,null,null,null,null,null,null,"Vf@Tj&I = Vf@I + Vf@Tj Modifier"]
[null,null,"Tc","Power","Thermal Resistance","Tc>>Tj",null,"Tj","Power","Thermal Resistance","Tj>>Tc",null,"Tc","Tj",{"$f":"IF(Simulator!$L$8=\"Case\",\"Tj\",\"Tc\")","v":"Tj"},null,"Ft","Fr@I Eqn",null,null,null,"Fr@I",null,"Fr@Tc Eqn",null,null,null,"Fr@Tc","F@Tc&I",null,"85 DC Factor","Vft",null,"Vf@I Eqn",null,null,null,"Vf@I","Vf@Tc Eqn",null,null,null,"Vf@Tc","Vf@Tc&I",null,"# of Die","Vf@I","Vf@Tj Modifier, per Die","Vf@Tj&I","Voltage Report"]
[null,"V6",{"$f":"IF(Simulator!$L$8=\"Case\",Simulator!$I$8,M6)","v":25},{"$f":"Simulator!$O$12*AR6/1000","v":{"$error":"#N/A"}},{"$f":"INDEX(MasterTable[],MATCH(Simulator!E15,MasterTable[P/N],0),COLUMN(MasterTable[Thermal Resistance]))","v":{"$error":"#N/A"}},{"$f":"C6+D6*E6","v":{"$error":"#N/A"}},null,{"$f":"IF(Simulator!$L$8=\"Case\",F6,Simulator!$I$8)","v":{"$error":"#N/A"}},{"$f":"Simulator!$O$12*AW6/1000","v":{"$error":"#N/A"}},{"$f":"E6","v":{"$error":"#N/A"}},{"$f":"H6-I6*J6","v":{"$error":"#N/A"}},null,{"$f":"IF(Simulator!$L$8=\"Case\",Simulator!$I$8,K6)","v":25},{"$f":"IF(Simulator!$L$8=\"Case\",H6,Simulator!$I$8)","v":{"$error":"#N/A"}},{"$f":"IF(#REF!=\"Tj\",N6,M6)","v":{"$error":"#REF!"}},null,{"$f":"INDEX(MasterTable[],MATCH(Simulator!E15,MasterTable[P/N],0),COLUMN(MasterTable[Typical Lumens]))","v":{"$error":"#N/A"}},{"$f":"INDEX(MasterTable[],MATCH(Simulator!$E15,MasterTable[P/N],0),COLUMN(MasterTable[I^3]))","v":{"$error":"#N/A"}},{"$f":"INDEX(MasterTable[],MATCH(Simulator!$E15,MasterTable[P/N],0),COLUMN(MasterTable[I^2]))","v":{"$error":"#N/A"}},{"$f":"INDEX(MasterTable[],MATCH(Simulator!$E15,MasterTable[P/N],0),COLUMN(MasterTable[I]))","v":{"$error":"#N/A"}},{"$f":"INDEX(MasterTable[],MATCH(Simulator!$E15,MasterTable[P/N],0),COLUMN(MasterTable[I0]))","v":{"$error":"#N/A"}},{"$f":"IF(Simulator!$O$12=Simulator!M15,1,R6*Simulator!$O$12^3+S6*Simulator!$O$12^2+T6*Simulator!$O$12+U6)","v":{"$error":"#N/A"}},{"$f":"INDEX(MasterTable[],MATCH(Simulator!$E15,MasterTable[P/N],0),COLUMN(MasterTable[F^4]))","v":{"$error":"#N/A"}},{"$f":"INDEX(MasterTable[],MATCH(Simulator!$E15,MasterTable[P/N],0),COLUMN(MasterTable[F^3]))","v":{"$error":"#N/A"}},{"$f":"INDEX(MasterTable[],MATCH(Simulator!$E15,MasterTable[P/N],0),COLUMN(MasterTable[F^2]))","v":{"$error":"#N/A"}},{"$f":"INDEX(MasterTable[],MATCH(Simulator!$E15,MasterTable[P/N],0),COLUMN(MasterTable[F]))","v":{"$error":"#N/A"}},{"$f":"INDEX(MasterTable[],MATCH(Simulator!$E15,MasterTable[P/N],0),COLUMN(MasterTable[F0]))","v":{"$error":"#N/A"}},{"$f":"IF(Simulator!$I$8=85,AE6,W6*M6^4+X6*M6^3+Y6*M6^2+Z6*M6+AA6)","v":{"$error":"#N/A"}},{"$f":"Q6*V6*AB6","v":{"$error":"#N/A"}},{"$f":"IF(AND(Simulator!$I$8=85,Simulator!$O$12=Simulator!M15),Q6*AE6,AC6)","v":{"$error":"#N/A"}},{"$f":"VLOOKUP(MID(Simulator!E15,6,3),V_6_85DC_Factor,2,FALSE)","v":{"$error":"#N/A"}},{"$f":"INDEX(MasterTable[],MATCH(Simulator!$E15,MasterTable[P/N],0),COLUMN(MasterTable[Typical Voltage]))","v":{"$error":"#N/A"}},{"$f":"INDEX(MasterTable[],MATCH(Simulator!$E15,MasterTable[P/N],0),COLUMN(MasterTable[V^4]))","v":{"$error":"#N/A"}},{"$f":"INDEX(MasterTable[],MATCH(Simulator!$E15,MasterTable[P/N],0),COLUMN(MasterTable[V^3]))","v":{"$error":"#N/A"}},{"$f":"INDEX(MasterTable[],MATCH(Simulator!$E15,MasterTable[P/N],0),COLUMN(MasterTable[V^2]))","v":{"$error":"#N/A"}},{"$f":"INDEX(MasterTable[],MATCH(Simulator!$E15,MasterTable[P/N],0),COLUMN(MasterTable[V]))","v":{"$error":"#N/A"}},{"$f":"INDEX(MasterTable[],MATCH(Simulator!$E15,MasterTable[P/N],0),COLUMN(MasterTable[V0]))","v":{"$error":"#N/A"}},{"$f":"AG6*Simulator!$O$12^4+AH6*Simulator!$O$12^3+AI6*Simulator!$O$12^2+AJ6*Simulator!$O$12+AK6","v":{"$error":"#N/A"}},{"$f":"INDEX(MasterTable[],MATCH(Simulator!$E15,MasterTable[P/N],0),COLUMN(MasterTable[T^3]))","v":{"$error":"#N/A"}},{"$f":"INDEX(MasterTable[],MATCH(Simulator!$E15,MasterTable[P/N],0),COLUMN(MasterTable[T^2]))","v":{"$error":"#N/A"}},{"$f":"INDEX(MasterTable[],MATCH(Simulator!$E15,MasterTable[P/N],0),COLUMN(MasterTable[T]))","v":{"$error":"#N/A"}},{"$f":"INDEX(MasterTable[],MATCH(Simulator!$E15,MasterTable[P/N],0),COLUMN(MasterTable[T0]))","v":{"$error":"#N/A"}},{"$f":"AM6*M6^3+AN6*M6^2+AO6*M6+AP6","v":{"$error":"#N/A"}},{"$f":"AL6+AQ6-AF6","v":{"$error":"#N/A"}},null,{"$f":"INDEX(MasterTable[],MATCH(Simulator!$E15,MasterTable[P/N],0),COLUMN(MasterTable['# of Die]))","v":{"$error":"#N/A"}},{"$f":"AL6","v":{"$error":"#N/A"}},{"$f":"INDEX(Tj_to_Vf6[],MATCH(Simulator!$I$8,Tj_to_Vf6[Vf],1),COLUMN(Tj_to_Vf6[Vf]))","v":-0.5},{"$f":"AU6+AV6*AT6","v":{"$error":"#N/A"}},{"$f":"IF(AND(Simulator!$I$8=25,Simulator!$O$12=Simulator!M15),AF6,AR6)","v":{"$error":"#N/A"}}]
[null,"V6",{"$f":"IF(Simulator!$L$8=\"Case\",Simulator!$I$8,M7)","v":25},{"$f":"Simulator!$O$12*AR7/1000","v":{"$error":"#N/A"}},{"$f":"INDEX(MasterTable[],MATCH(Simulator!E16,MasterTable[P/N],0),COLUMN(MasterTable[Thermal Resistance]))","v":{"$error":"#N/A"}},{"$f":"C7+D7*E7","v":{"$error":"#N/A"}},null,{"$f":"IF(Simulator!$L$8=\"Case\",F7,Simulator!$I$8)","v":{"$error":"#N/A"}},{"$f":"Simulator!$O$12*AW7/1000","v":{"$error":"#N/A"}},{"$f":"E7","v":{"$error":"#N/A"}},{"$f":"H7-I7*J7","v":{"$error":"#N/A"}},null,{"$f":"IF(Simulator!$L$8=\"Case\",Simulator!$I$8,K7)","v":25},{"$f":"IF(Simulator!$L$8=\"Case\",H7,Simulator!$I$8)","v":{"$error":"#N/A"}},{"$f":"IF(#REF!=\"Tj\",N7,M7)","v":{"$error":"#REF!"}},null,{"$f":"INDEX(MasterTable[],MATCH(Simulator!E16,MasterTable[P/N],0),COLUMN(MasterTable[Typical Lumens]))","v":{"$error":"#N/A"}},{"$f":"INDEX(MasterTable[],MATCH(Simulator!$E16,MasterTable[P/N],0),COLUMN(MasterTable[I^3]))","v":{"$error":"#N/A"}},{"$f":"INDEX(MasterTable[],MATCH(Simulator!$E16,MasterTable[P/N],0),COLUMN(MasterTable[I^2]))","v":{"$error":"#N/A"}},{"$f":"INDEX(MasterTable[],MATCH(Simulator!$E16,MasterTable[P/N],0),COLUMN(MasterTable[I]))","v":{"$error":"#N/A"}},{"$f":"INDEX(MasterTable[],MATCH(Simulator!$E16,MasterTable[P/N],0),COLUMN(MasterTable[I0]))","v":{"$error":"#N/A"}},{"$f":"IF(Simulator!$O$12=Simulator!M16,1,R7*Simulator!$O$12^3+S7*Simulator!$O$12^2+T7*Simulator!$O$12+U7)","v":{"$error":"#N/A"}},{"$f":"INDEX(MasterTable[],MATCH(Simulator!$E16,MasterTable[P/N],0),COLUMN(MasterTable[F^4]))","v":{"$error":"#N/A"}},{"$f":"INDEX(MasterTable[],MATCH(Simulator!$E16,MasterTable[P/N],0),COLUMN(MasterTable[F^3]))","v":{"$error":"#N/A"}},{"$f":"INDEX(MasterTable[],MATCH(Simulator!$E16,MasterTable[P/N],0),COLUMN(MasterTable[F^2]))","v":{"$error":"#N/A"}},{"$f":"INDEX(MasterTable[],MATCH(Simulator!$E16,MasterTable[P/N],0),COLUMN(MasterTable[F]))","v":{"$error":"#N/A"}},{"$f":"INDEX(MasterTable[],MATCH(Simulator!$E16,MasterTable[P/N],0),COLUMN(MasterTable[F0]))","v":{"$error":"#N/A"}},{"$f":"IF(Simulator!$I$8=85,AE7,W7*M7^4+X7*M7^3+Y7*M7^2+Z7*M7+AA7)","v":{"$error":"#N/A"}},{"$f":"Q7*V7*AB7","v":{"$error":"#N/A"}},{"$f":"IF(AND(Simulator!$I$8=85,Simulator!$O$12=Simulator!M16),Q7*AE7,AC7)","v":{"$error":"#N/A"}},{"$f":"VLOOKUP(MID(Simulator!E16,6,3),V_6_85DC_Factor,2,FALSE)","v":{"$error":"#N/A"}},{"$f":"INDEX(MasterTable[],MATCH(Simulator!$E16,MasterTable[P/N],0),COLUMN(MasterTable[Typical Voltage]))","v":{"$error":"#N/A"}},{"$f":"INDEX(MasterTable[],MATCH(Simulator!$E16,MasterTable[P/N],0),COLUMN(MasterTable[V^4]))","v":{"$error":"#N/A"}},{"$f":"INDEX(MasterTable[],MATCH(Simulator!$E16,MasterTable[P/N],0),COLUMN(MasterTable[V^3]))","v":{"$error":"#N/A"}},{"$f":"INDEX(MasterTable[],MATCH(Simulator!$E16,MasterTable[P/N],0),COLUMN(MasterTable[V^2]))","v":{"$error":"#N/A"}},{"$f":"INDEX(MasterTable[],MATCH(Simulator!$E16,MasterTable[P/N],0),COLUMN(MasterTable[V]))","v":{"$error":"#N/A"}},{"$f":"INDEX(MasterTable[],MATCH(Simulator!$E16,MasterTable[P/N],0),COLUMN(MasterTable[V0]))","v":{"$error":"#N/A"}},{"$f":"AG7*Simulator!$O$12^4+AH7*Simulator!$O$12^3+AI7*Simulator!$O$12^2+AJ7*Simulator!$O$12+AK7","v":{"$error":"#N/A"}},{"$f":"INDEX(MasterTable[],MATCH(Simulator!$E16,MasterTable[P/N],0),COLUMN(MasterTable[T^3]))","v":{"$error":"#N/A"}},{"$f":"INDEX(MasterTable[],MATCH(Simulator!$E16,MasterTable[P/N],0),COLUMN(MasterTable[T^2]))","v":{"$error":"#N/A"}},{"$f":"INDEX(MasterTable[],MATCH(Simulator!$E16,MasterTable[P/N],0),COLUMN(MasterTable[T]))","v":{"$error":"#N/A"}},{"$f":"INDEX(MasterTable[],MATCH(Simulator!$E16,MasterTable[P/N],0),COLUMN(MasterTable[T0]))","v":{"$error":"#N/A"}},{"$f":"AM7*M7^3+AN7*M7^2+AO7*M7+AP7","v":{"$error":"#N/A"}},{"$f":"AL7+AQ7-AF7","v":{"$error":"#N/A"}},null,{"$f":"INDEX(MasterTable[],MATCH(Simulator!$E16,MasterTable[P/N],0),COLUMN(MasterTable['# of Die]))","v":{"$error":"#N/A"}},{"$f":"AL7","v":{"$error":"#N/A"}},{"$f":"INDEX(Tj_to_Vf6[],MATCH(Simulator!$I$8,Tj_to_Vf6[Vf],1),COLUMN(Tj_to_Vf6[Vf]))","v":-0.5},{"$f":"AU7+AV7*AT7","v":{"$error":"#N/A"}},{"$f":"IF(AND(Simulator!$I$8=25,Simulator!$O$12=Simulator!M16),AF7,AR7)","v":{"$error":"#N/A"}}]
[null,"V8",{"$f":"IF(Simulator!$L$8=\"Case\",Simulator!$I$8,M8)","v":25},{"$f":"Simulator!$O$12*AR8/1000","v":{"$error":"#N/A"}},{"$f":"INDEX(MasterTable[],MATCH(Simulator!E17,MasterTable[P/N],0),COLUMN(MasterTable[Thermal Resistance]))","v":{"$error":"#N/A"}},{"$f":"C8+D8*E8","v":{"$error":"#N/A"}},null,{"$f":"IF(Simulator!$L$8=\"Case\",F8,Simulator!$I$8)","v":{"$error":"#N/A"}},{"$f":"Simulator!$O$12*AW8/1000","v":{"$error":"#N/A"}},{"$f":"E8","v":{"$error":"#N/A"}},{"$f":"H8-I8*J8","v":{"$error":"#N/A"}},null,{"$f":"IF(Simulator!$L$8=\"Case\",Simulator!$I$8,K8)","v":25},{"$f":"IF(Simulator!$L$8=\"Case\",H8,Simulator!$I$8)","v":{"$error":"#N/A"}},{"$f":"IF(#REF!=\"Tj\",N8,M8)","v":{"$error":"#REF!"}},null,{"$f":"INDEX(MasterTable[],MATCH(Simulator!E17,MasterTable[P/N],0),COLUMN(MasterTable[Typical Lumens]))","v":{"$error":"#N/A"}},{"$f":"INDEX(MasterTable[],MATCH(Simulator!$E17,MasterTable[P/N],0),COLUMN(MasterTable[I^3]))","v":{"$error":"#N/A"}},{"$f":"INDEX(MasterTable[],MATCH(Simulator!$E17,MasterTable[P/N],0),COLUMN(MasterTable[I^2]))","v":{"$error":"#N/A"}},{"$f":"INDEX(MasterTable[],MATCH(Simulator!$E17,MasterTable[P/N],0),COLUMN(MasterTable[I]))","v":{"$error":"#N/A"}},{"$f":"INDEX(MasterTable[],MATCH(Simulator!$E17,MasterTable[P/N],0),COLUMN(MasterTable[I0]))","v":{"$error":"#N/A"}},{"$f":"IF(Simulator!$O$12=Simulator!M17,1,R8*Simulator!$O$12^3+S8*Simulator!$O$12^2+T8*Simulator!$O$12+U8)","v":{"$error":"#N/A"}},{"$f":"INDEX(MasterTable[],MATCH(Simulator!$E17,MasterTable[P/N],0),COLUMN(MasterTable[F^4]))","v":{"$error":"#N/A"}},{"$f":"INDEX(MasterTable[],MATCH(Simulator!$E17,MasterTable[P/N],0),COLUMN(MasterTable[F^3]))","v":{"$error":"#N/A"}},{"$f":"INDEX(MasterTable[],MATCH(Simulator!$E17,MasterTable[P/N],0),COLUMN(MasterTable[F^2]))","v":{"$error":"#N/A"}},{"$f":"INDEX(MasterTable[],MATCH(Simulator!$E17,MasterTable[P/N],0),COLUMN(MasterTable[F]))","v":{"$error":"#N/A"}},{"$f":"INDEX(MasterTable[],MATCH(Simulator!$E17,MasterTable[P/N],0),COLUMN(MasterTable[F0]))","v":{"$error":"#N/A"}},{"$f":"IF(Simulator!$I$8=85,AE8,W8*M8^4+X8*M8^3+Y8*M8^2+Z8*M8+AA8)","v":{"$error":"#N/A"}},{"$error":"#N/A"},{"$f":"IF(AND(Simulator!O17=85,Simulator!$O$12=Simulator!M17),Q8*$AE$13,AC8)","v":{"$error":"#N/A"}},null,{"$f":"INDEX(MasterTable[],MATCH(Simulator!$E17,MasterTable[P/N],0),COLUMN(MasterTable[Typical Voltage]))","v":{"$error":"#N/A"}},{"$f":"INDEX(MasterTable[],MATCH(Simulator!$E17,MasterTable[P/N],0),COLUMN(MasterTable[V^4]))","v":{"$error":"#N/A"}},{"$f":"INDEX(MasterTable[],MATCH(Simulator!$E17,MasterTable[P/N],0),COLUMN(MasterTable[V^3]))","v":{"$error":"#N/A"}},{"$f":"INDEX(MasterTable[],MATCH(Simulator!$E17,MasterTable[P/N],0),COLUMN(MasterTable[V^2]))","v":{"$error":"#N/A"}},{"$f":"INDEX(MasterTable[],MATCH(Simulator!$E17,MasterTable[P/N],0),COLUMN(MasterTable[V]))","v":{"$error":"#N/A"}},{"$f":"INDEX(MasterTable[],MATCH(Simulator!$E17,MasterTable[P/N],0),COLUMN(MasterTable[V0]))","v":{"$error":"#N/A"}},{"$f":"AG8*Simulator!$O$12^4+AH8*Simulator!$O$12^3+AI8*Simulator!$O$12^2+AJ8*Simulator!$O$12+AK8","v":{"$error":"#N/A"}},{"$f":"INDEX(MasterTable[],MATCH(Simulator!$E17,MasterTable[P/N],0),COLUMN(MasterTable[T^3]))","v":{"$error":"#N/A"}},{"$f":"INDEX(MasterTable[],MATCH(Simulator!$E17,MasterTable[P/N],0),COLUMN(MasterTable[T^2]))","v":{"$error":"#N/A"}},{"$f":"INDEX(MasterTable[],MATCH(Simulator!$E17,MasterTable[P/N],0),COLUMN(MasterTable[T]))","v":{"$error":"#N/A"}},{"$f":"INDEX(MasterTable[],MATCH(Simulator!$E17,MasterTable[P/N],0),COLUMN(MasterTable[T0]))","v":{"$error":"#N/A"}},{"$error":"#N/A"},{"$error":"#N/A"},null,{"$f":"INDEX(MasterTable[],MATCH(Simulator!$E17,MasterTable[P/N],0),COLUMN(MasterTable['# of Die]))","v":{"$error":"#N/A"}},{"$error":"#N/A"},{"$f":"INDEX(Tj_to_Vf6[],MATCH(Simulator!$I$8,Tj_to_Vf6[Vf],1),COLUMN(Tj_to_Vf6[Vf]))","v":-0.5},{"$error":"#N/A"},{"$f":"IF(AND(Simulator!$I$8=25,Simulator!$O$12=Simulator!M17),AF8,AR8)","v":{"$error":"#N/A"}}]
[null,"V8",{"$f":"IF(Simulator!$L$8=\"Case\",Simulator!$I$8,M9)","v":25},{"$f":"Simulator!$O$12*AR9/1000","v":7.2136000000000013},{"$f":"INDEX(MasterTable[],MATCH(Simulator!E18,MasterTable[P/N],0),COLUMN(MasterTable[Thermal Resistance]))","v":0.71},{"$f":"C9+D9*E9","v":30.121656000000002},null,{"$f":"IF(Simulator!$L$8=\"Case\",F9,Simulator!$I$8)","v":30.121656000000002},{"$f":"Simulator!$O$12*AW9/1000","v":6.0136000000000012},{"$f":"E9","v":0.71},{"$f":"H9-I9*J9","v":25.852},null,{"$f":"IF(Simulator!$L$8=\"Case\",Simulator!$I$8,K9)","v":25},{"$f":"IF(Simulator!$L$8=\"Case\",H9,Simulator!$I$8)","v":30.121656000000002},{"$f":"IF(#REF!=\"Tj\",N9,M9)","v":{"$error":"#REF!"}},null,{"$f":"INDEX(MasterTable[],MATCH(Simulator!E18,MasterTable[P/N],0),COLUMN(MasterTable[Typical Lumens]))","v":716},{"$f":"INDEX(MasterTable[],MATCH(Simulator!$E18,MasterTable[P/N],0),COLUMN(MasterTable[I^3]))","v":0},{"$f":"INDEX(MasterTable[],MATCH(Simulator!$E18,MasterTable[P/N],0),COLUMN(MasterTable[I^2]))","v":-4.1047244976000001E-6},{"$f":"INDEX(MasterTable[],MATCH(Simulator!$E18,MasterTable[P/N],0),COLUMN(MasterTable[I]))","v":6.3759312470999998E-3},{"$f":"INDEX(MasterTable[],MATCH(Simulator!$E18,MasterTable[P/N],0),COLUMN(MasterTable[I0]))","v":7.2647760056000002E-3},{"$f":"IF(Simulator!$O$12=Simulator!M18,1,R9*Simulator!$O$12^3+S9*Simulator!$O$12^2+T9*Simulator!$O$12+U9)","v":1.1182620455215999},{"$f":"INDEX(MasterTable[],MATCH(Simulator!$E18,MasterTable[P/N],0),COLUMN(MasterTable[F^4]))","v":0},{"$f":"INDEX(MasterTable[],MATCH(Simulator!$E18,MasterTable[P/N],0),COLUMN(MasterTable[F^3]))","v":0},{"$f":"INDEX(MasterTable[],MATCH(Simulator!$E18,MasterTable[P/N],0),COLUMN(MasterTable[F^2]))","v":-6.6243244394999998E-6},{"$f":"INDEX(MasterTable[],MATCH(Simulator!$E18,MasterTable[P/N],0),COLUMN(MasterTable[F]))","v":-1.1278369862E-3},{"$f":"INDEX(MasterTable[],MATCH(Simulator!$E18,MasterTable[P/N],0),COLUMN(MasterTable[F0]))","v":1.0309770566000001},{"$f":"IF(Simulator!$I$8=85,AE9,W9*M9^4+X9*M9^3+Y9*M9^2+Z9*M9+AA9)","v":0.99864092917031255},799.58744970803878,{"$f":"IF(AND(Simulator!$I$8=85,Simulator!$O$12=Simulator!M18),Q9*AE9,AC9)","v":799.58744970803878},{"$f":"VLOOKUP(MID(Simulator!E18,6,3),V_8_85DC_Factor,2,FALSE)","v":0.88},{"$f":"INDEX(MasterTable[],MATCH(Simulator!$E18,MasterTable[P/N],0),COLUMN(MasterTable[Typical Voltage]))","v":35.6},{"$f":"INDEX(MasterTable[],MATCH(Simulator!$E18,MasterTable[P/N],0),COLUMN(MasterTable[V^4]))","v":-1.0000000000000001E-9},{"$f":"INDEX(MasterTable[],MATCH(Simulator!$E18,MasterTable[P/N],0),COLUMN(MasterTable[V^3]))","v":8.6600000000000005E-7},{"$f":"INDEX(MasterTable[],MATCH(Simulator!$E18,MasterTable[P/N],0),COLUMN(MasterTable[V^2]))","v":-2.7099999999999997E-4},{"$f":"INDEX(MasterTable[],MATCH(Simulator!$E18,MasterTable[P/N],0),COLUMN(MasterTable[V]))","v":5.4899999999999997E-2},{"$f":"INDEX(MasterTable[],MATCH(Simulator!$E18,MasterTable[P/N],0),COLUMN(MasterTable[V0]))","v":30.6},{"$f":"AG9*Simulator!$O$12^4+AH9*Simulator!$O$12^3+AI9*Simulator!$O$12^2+AJ9*Simulator!$O$12+AK9","v":36.068000000000005},{"$f":"INDEX(MasterTable[],MATCH(Simulator!$E18,MasterTable[P/N],0),COLUMN(MasterTable[T^3]))","v":0},{"$f":"INDEX(MasterTable[],MATCH(Simulator!$E18,MasterTable[P/N],0),COLUMN(MasterTable[T^2]))","v":0},{"$f":"INDEX(MasterTable[],MATCH(Simulator!$E18,MasterTable[P/N],0),COLUMN(MasterTable[T]))","v":-1.7000000000000001E-2},{"$f":"INDEX(MasterTable[],MATCH(Simulator!$E18,MasterTable[P/N],0),COLUMN(MasterTable[T0]))","v":36.024999999999999},35.6,36.068000000000005,null,{"$f":"INDEX(MasterTable[],MATCH(Simulator!$E18,MasterTable[P/N],0),COLUMN(MasterTable['# of Die]))","v":12},36.068000000000005,{"$f":"INDEX(Tj_to_Vf6[],MATCH(Simulator!$I$8,Tj_to_Vf6[Vf],1),COLUMN(Tj_to_Vf6[Vf]))","v":-0.5},30.068000000000005,{"$f":"IF(AND(Simulator!$I$8=25,Simulator!$O$12=Simulator!M18),AF9,AR9)","v":36.068000000000005}]
[null,"V8",{"$f":"IF(Simulator!$L$8=\"Case\",Simulator!$I$8,M10)","v":25},{"$f":"Simulator!$O$12*AR10/1000","v":3.4069644816067202},{"$f":"INDEX(MasterTable[],MATCH(Simulator!E19,MasterTable[P/N],0),COLUMN(MasterTable[Thermal Resistance]))","v":0.71},{"$f":"C10+D10*E10","v":27.41894478194077},null,{"$f":"IF(Simulator!$L$8=\"Case\",F10,Simulator!$I$8)","v":27.41894478194077},{"$f":"Simulator!$O$12*AW10/1000","v":2.20696448160672},{"$f":"E10","v":0.71},{"$f":"H10-I10*J10","v":25.851999999999997},null,{"$f":"IF(Simulator!$L$8=\"Case\",Simulator!$I$8,K10)","v":25},{"$f":"IF(Simulator!$L$8=\"Case\",H10,Simulator!$I$8)","v":27.41894478194077},{"$f":"IF(#REF!=\"Tj\",N10,M10)","v":{"$error":"#REF!"}},null,{"$f":"INDEX(MasterTable[],MATCH(Simulator!E19,MasterTable[P/N],0),COLUMN(MasterTable[Typical Lumens]))","v":716},{"$f":"INDEX(MasterTable[],MATCH(Simulator!$E19,MasterTable[P/N],0),COLUMN(MasterTable[I^3]))","v":0},{"$f":"INDEX(MasterTable[],MATCH(Simulator!$E19,MasterTable[P/N],0),COLUMN(MasterTable[I^2]))","v":-1.0261811244E-6},{"$f":"INDEX(MasterTable[],MATCH(Simulator!$E19,MasterTable[P/N],0),COLUMN(MasterTable[I]))","v":3.1879656235999998E-3},{"$f":"INDEX(MasterTable[],MATCH(Simulator!$E19,MasterTable[P/N],0),COLUMN(MasterTable[I0]))","v":7.2647760056000002E-3},{"$f":"IF(Simulator!$O$12=Simulator!M19,1,R10*Simulator!$O$12^3+S10*Simulator!$O$12^2+T10*Simulator!$O$12+U10)","v":0.60381065574960002},{"$f":"INDEX(MasterTable[],MATCH(Simulator!$E19,MasterTable[P/N],0),COLUMN(MasterTable[F^4]))","v":0},{"$f":"INDEX(MasterTable[],MATCH(Simulator!$E19,MasterTable[P/N],0),COLUMN(MasterTable[F^3]))","v":0},{"$f":"INDEX(MasterTable[],MATCH(Simulator!$E19,MasterTable[P/N],0),COLUMN(MasterTable[F^2]))","v":-6.6243244394999998E-6},{"$f":"INDEX(MasterTable[],MATCH(Simulator!$E19,MasterTable[P/N],0),COLUMN(MasterTable[F]))","v":-1.1278369862E-3},{"$f":"INDEX(MasterTable[],MATCH(Simulator!$E19,MasterTable[P/N],0),COLUMN(MasterTable[F0]))","v":1.0309770566000001},{"$f":"IF(Simulator!$I$8=85,AE10,W10*M10^4+X10*M10^3+Y10*M10^2+Z10*M10+AA10)","v":0.99864092917031255},431.74086455931291,{"$f":"IF(AND(Simulator!$I$8=85,Simulator!$O$12=Simulator!M19),Q10*AE10,AC10)","v":431.74086455931291},{"$f":"VLOOKUP(MID(Simulator!E19,6,3),V_8_85DC_Factor,2,FALSE)","v":0.88},{"$f":"INDEX(MasterTable[],MATCH(Simulator!$E19,MasterTable[P/N],0),COLUMN(MasterTable[Typical Voltage]))","v":17.8},{"$f":"INDEX(MasterTable[],MATCH(Simulator!$E19,MasterTable[P/N],0),COLUMN(MasterTable[V^4]))","v":-7.4382650239000006E-11},{"$f":"INDEX(MasterTable[],MATCH(Simulator!$E19,MasterTable[P/N],0),COLUMN(MasterTable[V^3]))","v":9.4360629142000003E-8},{"$f":"INDEX(MasterTable[],MATCH(Simulator!$E19,MasterTable[P/N],0),COLUMN(MasterTable[V^2]))","v":-4.4394203422999998E-5},{"$f":"INDEX(MasterTable[],MATCH(Simulator!$E19,MasterTable[P/N],0),COLUMN(MasterTable[V]))","v":1.4251995236000001E-2},{"$f":"INDEX(MasterTable[],MATCH(Simulator!$E19,MasterTable[P/N],0),COLUMN(MasterTable[V0]))","v":15.324318705},{"$f":"AG10*Simulator!$O$12^4+AH10*Simulator!$O$12^3+AI10*Simulator!$O$12^2+AJ10*Simulator!$O$12+AK10","v":17.034822408033598},{"$f":"INDEX(MasterTable[],MATCH(Simulator!$E19,MasterTable[P/N],0),COLUMN(MasterTable[T^3]))","v":0},{"$f":"INDEX(MasterTable[],MATCH(Simulator!$E19,MasterTable[P/N],0),COLUMN(MasterTable[T^2]))","v":0},{"$f":"INDEX(MasterTable[],MATCH(Simulator!$E19,MasterTable[P/N],0),COLUMN(MasterTable[T]))","v":-7.0000000000000001E-3},{"$f":"INDEX(MasterTable[],MATCH(Simulator!$E19,MasterTable[P/N],0),COLUMN(MasterTable[T0]))","v":17.975000000000001},17.8,17.034822408033602,null,{"$f":"INDEX(MasterTable[],MATCH(Simulator!$E19,MasterTable[P/N],0),COLUMN(MasterTable['# of Die]))","v":12},17.034822408033598,{"$f":"INDEX(Tj_to_Vf6[],MATCH(Simulator!$I$8,Tj_to_Vf6[Vf],1),COLUMN(Tj_to_Vf6[Vf]))","v":-0.5},11.034822408033598,{"$f":"IF(AND(Simulator!$I$8=25,Simulator!$O$12=Simulator!M19),AF10,AR10)","v":17.034822408033602}]
[null,"V10",{"$f":"IF(Simulator!$L$8=\"Case\",Simulator!$I$8,M11)","v":25},{"$f":"Simulator!$O$12*AR11/1000","v":5.0478080000000007},{"$f":"INDEX(MasterTable[],MATCH(Simulator!E20,MasterTable[P/N],0),COLUMN(MasterTable[Thermal Resistance]))","v":0.47},27.372469760000001,null,{"$f":"IF(Simulator!$L$8=\"Case\",F11,Simulator!$I$8)","v":27.372469760000001},{"$f":"Simulator!$O$12*AW11/1000","v":3.247808},0.47,25.846,null,{"$f":"IF(Simulator!$L$8=\"Case\",Simulator!$I$8,K11)","v":25},{"$f":"IF(Simulator!$L$8=\"Case\",H11,Simulator!$I$8)","v":27.372469760000001},{"$f":"IF(#REF!=\"Tj\",N11,M11)","v":{"$error":"#REF!"}},null,{"$f":"INDEX(MasterTable[],MATCH(Simulator!E20,MasterTable[P/N],0),COLUMN(MasterTable[Typical Lumens]))","v":1076},{"$f":"INDEX(MasterTable[],MATCH(Simulator!$E20,MasterTable[P/N],0),COLUMN(MasterTable[I^3]))","v":0},{"$f":"INDEX(MasterTable[],MATCH(Simulator!$E20,MasterTable[P/N],0),COLUMN(MasterTable[I^2]))","v":-8.2389999999999996E-7},{"$f":"INDEX(MasterTable[],MATCH(Simulator!$E20,MasterTable[P/N],0),COLUMN(MasterTable[I]))","v":3.1546209999999998E-3},{"$f":"INDEX(MasterTable[],MATCH(Simulator!$E20,MasterTable[P/N],0),COLUMN(MasterTable[I0]))","v":0},{"$f":"IF(Simulator!$O$12=Simulator!M20,1,R11*Simulator!$O$12^3+S11*Simulator!$O$12^2+T11*Simulator!$O$12+U11)","v":0.59796819999999995},{"$f":"INDEX(MasterTable[],MATCH(Simulator!$E20,MasterTable[P/N],0),COLUMN(MasterTable[F^4]))","v":0},{"$f":"INDEX(MasterTable[],MATCH(Simulator!$E20,MasterTable[P/N],0),COLUMN(MasterTable[F^3]))","v":0},{"$f":"INDEX(MasterTable[],MATCH(Simulator!$E20,MasterTable[P/N],0),COLUMN(MasterTable[F^2]))","v":-4.8574999999999997E-6},{"$f":"INDEX(MasterTable[],MATCH(Simulator!$E20,MasterTable[P/N],0),COLUMN(MasterTable[F]))","v":-1.1899886999999999E-3},{"$f":"INDEX(MasterTable[],MATCH(Simulator!$E20,MasterTable[P/N],0),COLUMN(MasterTable[F0]))","v":1.0322715723},{"$f":"IF(Simulator!$I$8=85,AE11,W11*M11^4+X11*M11^3+Y11*M11^2+Z11*M11+AA11)","v":0.99948591730000003},643.08301530511528,{"$f":"IF(AND(Simulator!$I$8=85,Simulator!$O$12=Simulator!M20),Q11*AE11,AC11)","v":643.08301530511528},{"$f":"VLOOKUP(MID(Simulator!E20,6,3),V_10_85DC_Factor,2,FALSE)","v":0.896027095},{"$f":"INDEX(MasterTable[],MATCH(Simulator!$E20,MasterTable[P/N],0),COLUMN(MasterTable[Typical Voltage]))","v":26.5},{"$f":"INDEX(MasterTable[],MATCH(Simulator!$E20,MasterTable[P/N],0),COLUMN(MasterTable[V^4]))","v":-3.2099999999999998E-11},{"$f":"INDEX(MasterTable[],MATCH(Simulator!$E20,MasterTable[P/N],0),COLUMN(MasterTable[V^3]))","v":5.4800000000000001E-8},{"$f":"INDEX(MasterTable[],MATCH(Simulator!$E20,MasterTable[P/N],0),COLUMN(MasterTable[V^2]))","v":-3.5200000000000002E-5},{"$f":"INDEX(MasterTable[],MATCH(Simulator!$E20,MasterTable[P/N],0),COLUMN(MasterTable[V]))","v":1.78E-2},{"$f":"INDEX(MasterTable[],MATCH(Simulator!$E20,MasterTable[P/N],0),COLUMN(MasterTable[V0]))","v":22.7},{"$f":"AG11*Simulator!$O$12^4+AH11*Simulator!$O$12^3+AI11*Simulator!$O$12^2+AJ11*Simulator!$O$12+AK11","v":25.239039999999999},{"$f":"INDEX(MasterTable[],MATCH(Simulator!$E20,MasterTable[P/N],0),COLUMN(MasterTable[T^3]))","v":0},{"$f":"INDEX(MasterTable[],MATCH(Simulator!$E20,MasterTable[P/N],0),COLUMN(MasterTable[T^2]))","v":0},{"$f":"INDEX(MasterTable[],MATCH(Simulator!$E20,MasterTable[P/N],0),COLUMN(MasterTable[T]))","v":-1.4E-2},{"$f":"INDEX(MasterTable[],MATCH(Simulator!$E20,MasterTable[P/N],0),COLUMN(MasterTable[T0]))","v":26.85},26.5,25.239040000000003,null,{"$f":"INDEX(MasterTable[],MATCH(Simulator!$E20,MasterTable[P/N],0),COLUMN(MasterTable['# of Die]))","v":18},25.239039999999999,{"$f":"INDEX(Tj_to_Vf6[],MATCH(Simulator!$I$8,Tj_to_Vf6[Vf],1),COLUMN(Tj_to_Vf6[Vf]))","v":-0.5},16.239039999999999,{"$f":"IF(AND(Simulator!$I$8=25,Simulator!$O$12=Simulator!M20),AF11,AR11)","v":25.239040000000003}]
[null,"V13",{"$f":"IF(Simulator!$L$8=\"Case\",Simulator!$I$8,M12)","v":25},{"$f":"Simulator!$O$12*AR12/1000","v":6.0728424582825937},{"$f":"INDEX(MasterTable[],MATCH(Simulator!E21,MasterTable[P/N],0),COLUMN(MasterTable[Thermal Resistance]))","v":0.22},{"$f":"C12+D12*E12","v":26.336025340822172},null,{"$f":"IF(Simulator!$L$8=\"Case\",F12,Simulator!$I$8)","v":26.336025340822172},{"$f":"Simulator!$O$12*AW12/1000","v":2.7728424582825926},{"$f":"E12","v":0.22},{"$f":"H12-I12*J12","v":25.726000000000003},null,{"$f":"IF(Simulator!$L$8=\"Case\",Simulator!$I$8,K12)","v":25},{"$f":"IF(Simulator!$L$8=\"Case\",H12,Simulator!$I$8)","v":26.336025340822172},{"$f":"IF(#REF!=\"Tj\",N12,M12)","v":{"$error":"#REF!"}},null,{"$f":"INDEX(MasterTable[],MATCH(Simulator!E21,MasterTable[P/N],0),COLUMN(MasterTable[Typical Lumens]))","v":1900},{"$f":"INDEX(MasterTable[],MATCH(Simulator!$E21,MasterTable[P/N],0),COLUMN(MasterTable[I^3]))","v":0},{"$f":"INDEX(MasterTable[],MATCH(Simulator!$E21,MasterTable[P/N],0),COLUMN(MasterTable[I^2]))","v":-5.2056577008E-7},{"$f":"INDEX(MasterTable[],MATCH(Simulator!$E21,MasterTable[P/N],0),COLUMN(MasterTable[I]))","v":2.2529763468E-3},{"$f":"INDEX(MasterTable[],MATCH(Simulator!$E21,MasterTable[P/N],0),COLUMN(MasterTable[I0]))","v":4.8311928226E-3},{"$f":"IF(Simulator!$O$12=Simulator!M21,1,R12*Simulator!$O$12^3+S12*Simulator!$O$12^2+T12*Simulator!$O$12+U12)","v":0.43460383137939995},{"$f":"INDEX(MasterTable[],MATCH(Simulator!$E21,MasterTable[P/N],0),COLUMN(MasterTable[F^4]))","v":0},{"$f":"INDEX(MasterTable[],MATCH(Simulator!$E21,MasterTable[P/N],0),COLUMN(MasterTable[F^3]))","v":-1.02E-7},{"$f":"INDEX(MasterTable[],MATCH(Simulator!$E21,MasterTable[P/N],0),COLUMN(MasterTable[F^2]))","v":1.27E-5},{"$f":"INDEX(MasterTable[],MATCH(Simulator!$E21,MasterTable[P/N],0),COLUMN(MasterTable[F]))","v":-2.0200000000000001E-3},{"$f":"INDEX(MasterTable[],MATCH(Simulator!$E21,MasterTable[P/N],0),COLUMN(MasterTable[F0]))","v":1.04},{"$f":"W12*M12^4+X12*M12^3+Y12*M12^2+Z12*M12+AA12","v":0.99584375000000003},{"$f":"Q12*V12*AB12","v":822.31526748993576},{"$f":"AC12","v":822.31526748993576},{"$f":"VLOOKUP(MID(Simulator!E21,6,3),Vero13_85DC_Factor,2,FALSE)","v":0.88},{"$f":"INDEX(MasterTable[],MATCH(Simulator!$E21,MasterTable[P/N],0),COLUMN(MasterTable[Typical Voltage]))","v":32.299999999999997},{"$f":"INDEX(MasterTable[],MATCH(Simulator!$E21,MasterTable[P/N],0),COLUMN(MasterTable[V^4]))","v":-9.5076604018999997E-12},{"$f":"INDEX(MasterTable[],MATCH(Simulator!$E21,MasterTable[P/N],0),COLUMN(MasterTable[V^3]))","v":2.4428286607E-8},{"$f":"INDEX(MasterTable[],MATCH(Simulator!$E21,MasterTable[P/N],0),COLUMN(MasterTable[V^2]))","v":-2.3169246580000001E-5},{"$f":"INDEX(MasterTable[],MATCH(Simulator!$E21,MasterTable[P/N],0),COLUMN(MasterTable[V]))","v":1.4970494217E-2},{"$f":"INDEX(MasterTable[],MATCH(Simulator!$E21,MasterTable[P/N],0),COLUMN(MasterTable[V0]))","v":28.116669275},{"$f":"AG12*Simulator!$O$12^4+AH12*Simulator!$O$12^3+AI12*Simulator!$O$12^2+AJ12*Simulator!$O$12+AK12","v":30.364212291412962},{"$f":"INDEX(MasterTable[],MATCH(Simulator!$E21,MasterTable[P/N],0),COLUMN(MasterTable[T^3]))","v":0},{"$f":"INDEX(MasterTable[],MATCH(Simulator!$E21,MasterTable[P/N],0),COLUMN(MasterTable[T^2]))","v":0},{"$f":"INDEX(MasterTable[],MATCH(Simulator!$E21,MasterTable[P/N],0),COLUMN(MasterTable[T]))","v":-1.7000000000000001E-2},{"$f":"INDEX(MasterTable[],MATCH(Simulator!$E21,MasterTable[P/N],0),COLUMN(MasterTable[T0]))","v":32.725000000000001},{"$f":"AM12*M12^3+AN12*M12^2+AO12*M12+AP12","v":32.300000000000004},{"$f":"AL12+AQ12-AF12","v":30.364212291412969},null,{"$f":"INDEX(MasterTable[],MATCH(Simulator!$E21,MasterTable[P/N],0),COLUMN(MasterTable['# of Die]))","v":33},{"$f":"AL12","v":30.364212291412962},{"$f":"INDEX(Tj_to_Vf6[],MATCH(Simulator!$I$8,Tj_to_Vf6[Vf],1),COLUMN(Tj_to_Vf6[Vf]))","v":-0.5},{"$f":"AU12+AV12*AT12","v":13.864212291412962},{"$f":"IF(AND(Simulator!$I$8=25,Simulator!$O$12=Simulator!M21),AF12,AR12)","v":30.364212291412969}]
[null,"V15",{"$f":"IF(Simulator!$L$8=\"Case\",Simulator!$I$8,M13)","v":25},{"$f":"Simulator!$O$12*AR13/1000","v":6.6304000000000007},{"$f":"INDEX(MasterTable[],MATCH(Simulator!E22,MasterTable[P/N],0),COLUMN(MasterTable[Thermal Resistance]))","v":0.16},{"$f":"C13+D13*E13","v":26.060863999999999},null,{"$f":"IF(Simulator!$L$8=\"Case\",F13,Simulator!$I$8)","v":26.060863999999999},{"$f":"Simulator!$O$12*AW13/1000","v":1.8304},{"$f":"E13","v":0.16},{"$f":"H13-I13*J13","v":25.767999999999997},null,{"$f":"IF(Simulator!$L$8=\"Case\",Simulator!$I$8,K13)","v":25},{"$f":"IF(Simulator!$L$8=\"Case\",H13,Simulator!$I$8)","v":26.060863999999999},{"$f":"IF(#REF!=\"Tj\",N13,M13)","v":{"$error":"#REF!"}},null,{"$f":"INDEX(MasterTable[],MATCH(Simulator!E22,MasterTable[P/N],0),COLUMN(MasterTable[Typical Lumens]))","v":2822},{"$f":"INDEX(MasterTable[],MATCH(Simulator!$E22,MasterTable[P/N],0),COLUMN(MasterTable[I^3]))","v":0},{"$f":"INDEX(MasterTable[],MATCH(Simulator!$E22,MasterTable[P/N],0),COLUMN(MasterTable[I^2]))","v":-2.826E-7},{"$f":"INDEX(MasterTable[],MATCH(Simulator!$E22,MasterTable[P/N],0),COLUMN(MasterTable[I]))","v":1.6303876000000001E-3},{"$f":"INDEX(MasterTable[],MATCH(Simulator!$E22,MasterTable[P/N],0),COLUMN(MasterTable[I0]))","v":0},{"$f":"IF(Simulator!$O$12=Simulator!M22,1,R13*Simulator!$O$12^3+S13*Simulator!$O$12^2+T13*Simulator!$O$12+U13)","v":0.31477352000000003},{"$f":"INDEX(MasterTable[],MATCH(Simulator!$E22,MasterTable[P/N],0),COLUMN(MasterTable[F^4]))","v":0},{"$f":"INDEX(MasterTable[],MATCH(Simulator!$E22,MasterTable[P/N],0),COLUMN(MasterTable[F^3]))","v":0},{"$f":"INDEX(MasterTable[],MATCH(Simulator!$E22,MasterTable[P/N],0),COLUMN(MasterTable[F^2]))","v":-5.2610000000000001E-6},{"$f":"INDEX(MasterTable[],MATCH(Simulator!$E22,MasterTable[P/N],0),COLUMN(MasterTable[F]))","v":-1.1508107E-3},{"$f":"INDEX(MasterTable[],MATCH(Simulator!$E22,MasterTable[P/N],0),COLUMN(MasterTable[F0]))","v":1.0294046488999999},{"$f":"IF(Simulator!$I$8=85,AE13,W13*M13^4+X13*M13^3+Y13*M13^2+Z13*M13+AA13)","v":0.99734625639999996},{"$f":"Q13*V13*AB13","v":885.93357721967016},{"$f":"IF(AND(Simulator!$I$8=85,Simulator!$O$12=Simulator!M22),Q13*AE13,AC13)","v":885.93357721967016},{"$f":"VLOOKUP(MID(Simulator!E22,6,3),V_15_85DC_Factor,2,FALSE)","v":0.89357501399999995},{"$f":"INDEX(MasterTable[],MATCH(Simulator!$E22,MasterTable[P/N],0),COLUMN(MasterTable[Typical Voltage]))","v":36},{"$f":"INDEX(MasterTable[],MATCH(Simulator!$E22,MasterTable[P/N],0),COLUMN(MasterTable[V^4]))","v":-2.6999999999999998E-12},{"$f":"INDEX(MasterTable[],MATCH(Simulator!$E22,MasterTable[P/N],0),COLUMN(MasterTable[V^3]))","v":9.5399999999999997E-9},{"$f":"INDEX(MasterTable[],MATCH(Simulator!$E22,MasterTable[P/N],0),COLUMN(MasterTable[V^2]))","v":-1.2500000000000001E-5},{"$f":"INDEX(MasterTable[],MATCH(Simulator!$E22,MasterTable[P/N],0),COLUMN(MasterTable[V]))","v":1.1900000000000001E-2},{"$f":"INDEX(MasterTable[],MATCH(Simulator!$E22,MasterTable[P/N],0),COLUMN(MasterTable[V0]))","v":31.2},{"$f":"AG13*Simulator!$O$12^4+AH13*Simulator!$O$12^3+AI13*Simulator!$O$12^2+AJ13*Simulator!$O$12+AK13","v":33.152000000000001},{"$f":"INDEX(MasterTable[],MATCH(Simulator!$E22,MasterTable[P/N],0),COLUMN(MasterTable[T^3]))","v":0},{"$f":"INDEX(MasterTable[],MATCH(Simulator!$E22,MasterTable[P/N],0),COLUMN(MasterTable[T^2]))","v":0},{"$f":"INDEX(MasterTable[],MATCH(Simulator!$E22,MasterTable[P/N],0),COLUMN(MasterTable[T]))","v":-1.7000000000000001E-2},{"$f":"INDEX(MasterTable[],MATCH(Simulator!$E22,MasterTable[P/N],0),COLUMN(MasterTable[T0]))","v":36.424999999999997},{"$f":"AM13*M13^3+AN13*M13^2+AO13*M13+AP13","v":36},{"$f":"AL13+AQ13-AF13","v":33.152000000000001},null,{"$f":"INDEX(MasterTable[],MATCH(Simulator!$E22,MasterTable[P/N],0),COLUMN(MasterTable['# of Die]))","v":48},{"$f":"AL13","v":33.152000000000001},{"$f":"INDEX(Tj_to_Vf6[],MATCH(Simulator!$I$8,Tj_to_Vf6[Vf],1),COLUMN(Tj_to_Vf6[Vf]))","v":-0.5},{"$f":"AU13+AV13*AT13","v":9.152000000000001},{"$f":"IF(AND(Simulator!$I$8=25,Simulator!$O$12=Simulator!M22),AF13,AR13)","v":33.152000000000001}]
[null,"V18",{"$f":"IF(Simulator!$L$8=\"Case\",Simulator!$I$8,M14)","v":25},{"$f":"Simulator!$O$12*AR14/1000","v":5.3436754521072771},{"$f":"INDEX(MasterTable[],MATCH(Simulator!E23,MasterTable[P/N],0),COLUMN(MasterTable[Thermal Resistance]))","v":0.13},{"$f":"C14+D14*E14","v":25.694677808773946},null,{"$f":"IF(Simulator!$L$8=\"Case\",F14,Simulator!$I$8)","v":25.694677808773946},{"$f":"Simulator!$O$12*AW14/1000","v":-0.65632454789272354},{"$f":"E14","v":0.13},{"$f":"H14-I14*J14","v":25.78},null,{"$f":"IF(Simulator!$L$8=\"Case\",Simulator!$I$8,K14)","v":25},{"$f":"IF(Simulator!$L$8=\"Case\",H14,Simulator!$I$8)","v":25.694677808773946},{"$f":"IF(#REF!=\"Tj\",N14,M14)","v":{"$error":"#REF!"}},null,{"$f":"INDEX(MasterTable[],MATCH(Simulator!E23,MasterTable[P/N],0),COLUMN(MasterTable[Typical Lumens]))","v":3670},{"$f":"INDEX(MasterTable[],MATCH(Simulator!$E23,MasterTable[P/N],0),COLUMN(MasterTable[I^3]))","v":0},{"$f":"INDEX(MasterTable[],MATCH(Simulator!$E23,MasterTable[P/N],0),COLUMN(MasterTable[I^2]))","v":-1.3106025059999999E-7},{"$f":"INDEX(MasterTable[],MATCH(Simulator!$E23,MasterTable[P/N],0),COLUMN(MasterTable[I]))","v":1.0878699984E-3},{"$f":"INDEX(MasterTable[],MATCH(Simulator!$E23,MasterTable[P/N],0),COLUMN(MasterTable[I0]))","v":4.2883455537999996E-3},{"$f":"IF(Simulator!$O$12=Simulator!M23,1,R14*Simulator!$O$12^3+S14*Simulator!$O$12^2+T14*Simulator!$O$12+U14)","v":0.21661993520980002},{"$f":"INDEX(MasterTable[],MATCH(Simulator!$E23,MasterTable[P/N],0),COLUMN(MasterTable[F^4]))","v":0},{"$f":"INDEX(MasterTable[],MATCH(Simulator!$E23,MasterTable[P/N],0),COLUMN(MasterTable[F^3]))","v":-1.8425800000000001E-7},{"$f":"INDEX(MasterTable[],MATCH(Simulator!$E23,MasterTable[P/N],0),COLUMN(MasterTable[F^2]))","v":2.5068200000000002E-5},{"$f":"INDEX(MasterTable[],MATCH(Simulator!$E23,MasterTable[P/N],0),COLUMN(MasterTable[F]))","v":-2.5901499999999998E-3},{"$f":"INDEX(MasterTable[],MATCH(Simulator!$E23,MasterTable[P/N],0),COLUMN(MasterTable[F0]))","v":1.05063},{"$f":"W14*M14^4+X14*M14^3+Y14*M14^2+Z14*M14+AA14","v":0.99866484374999998},{"$f":"Q14*V14*AB14","v":793.93371946040838},{"$f":"AC14","v":793.93371946040838},{"$f":"VLOOKUP(MID(Simulator!E23,6,3),Vero18_85DC_Factor,2,FALSE)","v":0.88},{"$f":"INDEX(MasterTable[],MATCH(Simulator!$E23,MasterTable[P/N],0),COLUMN(MasterTable[Typical Voltage]))","v":29.5},{"$f":"INDEX(MasterTable[],MATCH(Simulator!$E23,MasterTable[P/N],0),COLUMN(MasterTable[V^4]))","v":-4.3296141676000001E-13},{"$f":"INDEX(MasterTable[],MATCH(Simulator!$E23,MasterTable[P/N],0),COLUMN(MasterTable[V^3]))","v":2.4210131023999999E-9},{"$f":"INDEX(MasterTable[],MATCH(Simulator!$E23,MasterTable[P/N],0),COLUMN(MasterTable[V^2]))","v":-5.0293161703999997E-6},{"$f":"INDEX(MasterTable[],MATCH(Simulator!$E23,MasterTable[P/N],0),COLUMN(MasterTable[V]))","v":6.8884526139999999E-3},{"$f":"INDEX(MasterTable[],MATCH(Simulator!$E23,MasterTable[P/N],0),COLUMN(MasterTable[V0]))","v":25.523184017999998},{"$f":"AG14*Simulator!$O$12^4+AH14*Simulator!$O$12^3+AI14*Simulator!$O$12^2+AJ14*Simulator!$O$12+AK14","v":26.718377260536382},{"$f":"INDEX(MasterTable[],MATCH(Simulator!$E23,MasterTable[P/N],0),COLUMN(MasterTable[T^3]))","v":0},{"$f":"INDEX(MasterTable[],MATCH(Simulator!$E23,MasterTable[P/N],0),COLUMN(MasterTable[T^2]))","v":0},{"$f":"INDEX(MasterTable[],MATCH(Simulator!$E23,MasterTable[P/N],0),COLUMN(MasterTable[T]))","v":-1.4999999999999999E-2},{"$f":"INDEX(MasterTable[],MATCH(Simulator!$E23,MasterTable[P/N],0),COLUMN(MasterTable[T0]))","v":29.875},{"$f":"AM14*M14^3+AN14*M14^2+AO14*M14+AP14","v":29.5},{"$f":"AL14+AQ14-AF14","v":26.718377260536386},null,{"$f":"INDEX(MasterTable[],MATCH(Simulator!$E23,MasterTable[P/N],0),COLUMN(MasterTable['# of Die]))","v":60},{"$f":"AL14","v":26.718377260536382},{"$f":"INDEX(Tj_to_Vf6[],MATCH(Simulator!$I$8,Tj_to_Vf6[Vf],1),COLUMN(Tj_to_Vf6[Vf]))","v":-0.5},{"$f":"AU14+AV14*AT14","v":-3.2816227394636179},{"$f":"IF(AND(Simulator!$I$8=25,Simulator!$O$12=Simulator!M23),AF14,AR14)","v":26.718377260536386}]
[null,"V22",{"$f":"IF(Simulator!$L$8=\"Case\",Simulator!$I$8,M15)","v":25},{"$f":"Simulator!$O$12*AR15/1000","v":{"$error":"#N/A"}},{"$f":"INDEX(MasterTable[],MATCH(Simulator!E24,MasterTable[P/N],0),COLUMN(MasterTable[Thermal Resistance]))","v":{"$error":"#N/A"}},{"$f":"C15+D15*E15","v":{"$error":"#N/A"}},null,{"$f":"IF(Simulator!$L$8=\"Case\",F15,Simulator!$I$8)","v":{"$error":"#N/A"}},{"$f":"Simulator!$O$12*AW15/1000","v":{"$error":"#N/A"}},{"$f":"E15","v":{"$error":"#N/A"}},{"$f":"H15-I15*J15","v":{"$error":"#N/A"}},null,{"$f":"IF(Simulator!$L$8=\"Case\",Simulator!$I$8,K15)","v":25},{"$f":"IF(Simulator!$L$8=\"Case\",H15,Simulator!$I$8)","v":{"$error":"#N/A"}},{"$f":"IF(#REF!=\"Tj\",N15,M15)","v":{"$error":"#REF!"}},null,{"$f":"INDEX(MasterTable[],MATCH(Simulator!E24,MasterTable[P/N],0),COLUMN(MasterTable[Typical Lumens]))","v":{"$error":"#N/A"}},{"$f":"INDEX(MasterTable[],MATCH(Simulator!$E24,MasterTable[P/N],0),COLUMN(MasterTable[I^3]))","v":{"$error":"#N/A"}},{"$f":"INDEX(MasterTable[],MATCH(Simulator!$E24,MasterTable[P/N],0),COLUMN(MasterTable[I^2]))","v":{"$error":"#N/A"}},{"$f":"INDEX(MasterTable[],MATCH(Simulator!$E24,MasterTable[P/N],0),COLUMN(MasterTable[I]))","v":{"$error":"#N/A"}},{"$f":"INDEX(MasterTable[],MATCH(Simulator!$E24,MasterTable[P/N],0),COLUMN(MasterTable[I0]))","v":{"$error":"#N/A"}},{"$f":"IF(Simulator!$O$12=Simulator!M24,1,R15*Simulator!$O$12^3+S15*Simulator!$O$12^2+T15*Simulator!$O$12+U15)","v":{"$error":"#N/A"}},{"$f":"INDEX(MasterTable[],MATCH(Simulator!$E24,MasterTable[P/N],0),COLUMN(MasterTable[F^4]))","v":{"$error":"#N/A"}},{"$f":"INDEX(MasterTable[],MATCH(Simulator!$E24,MasterTable[P/N],0),COLUMN(MasterTable[F^3]))","v":{"$error":"#N/A"}},{"$f":"INDEX(MasterTable[],MATCH(Simulator!$E24,MasterTable[P/N],0),COLUMN(MasterTable[F^2]))","v":{"$error":"#N/A"}},{"$f":"INDEX(MasterTable[],MATCH(Simulator!$E24,MasterTable[P/N],0),COLUMN(MasterTable[F]))","v":{"$error":"#N/A"}},{"$f":"INDEX(MasterTable[],MATCH(Simulator!$E24,MasterTable[P/N],0),COLUMN(MasterTable[F0]))","v":{"$error":"#N/A"}},{"$f":"W15*M15^4+X15*M15^3+Y15*M15^2+Z15*M15+AA15","v":{"$error":"#N/A"}},{"$f":"Q15*V15*AB15","v":{"$error":"#N/A"}},{"$f":"AC15","v":{"$error":"#N/A"}},{"$f":"VLOOKUP(MID(Simulator!E24,6,3),V22_85DC_Factor,2,FALSE)","v":{"$error":"#N/A"}},{"$f":"INDEX(MasterTable[],MATCH(Simulator!$E24,MasterTable[P/N],0),COLUMN(MasterTable[Typical Voltage]))","v":{"$error":"#N/A"}},{"$f":"INDEX(MasterTable[],MATCH(Simulator!$E24,MasterTable[P/N],0),COLUMN(MasterTable[V^4]))","v":{"$error":"#N/A"}},{"$f":"INDEX(MasterTable[],MATCH(Simulator!$E24,MasterTable[P/N],0),COLUMN(MasterTable[V^3]))","v":{"$error":"#N/A"}},{"$f":"INDEX(MasterTable[],MATCH(Simulator!$E24,MasterTable[P/N],0),COLUMN(MasterTable[V^2]))","v":{"$error":"#N/A"}},{"$f":"INDEX(MasterTable[],MATCH(Simulator!$E24,MasterTable[P/N],0),COLUMN(MasterTable[V]))","v":{"$error":"#N/A"}},{"$f":"INDEX(MasterTable[],MATCH(Simulator!$E24,MasterTable[P/N],0),COLUMN(MasterTable[V0]))","v":{"$error":"#N/A"}},{"$f":"AG15*Simulator!$O$12^4+AH15*Simulator!$O$12^3+AI15*Simulator!$O$12^2+AJ15*Simulator!$O$12+AK15","v":{"$error":"#N/A"}},{"$f":"INDEX(MasterTable[],MATCH(Simulator!$E24,MasterTable[P/N],0),COLUMN(MasterTable[T^3]))","v":{"$error":"#N/A"}},{"$f":"INDEX(MasterTable[],MATCH(Simulator!$E24,MasterTable[P/N],0),COLUMN(MasterTable[T^2]))","v":{"$error":"#N/A"}},{"$f":"INDEX(MasterTable[],MATCH(Simulator!$E24,MasterTable[P/N],0),COLUMN(MasterTable[T]))","v":{"$error":"#N/A"}},{"$f":"INDEX(MasterTable[],MATCH(Simulator!$E24,MasterTable[P/N],0),COLUMN(MasterTable[T0]))","v":{"$error":"#N/A"}},{"$f":"AM15*M15^3+AN15*M15^2+AO15*M15+AP15","v":{"$error":"#N/A"}},{"$f":"AL15+AQ15-AF15","v":{"$error":"#N/A"}},null,{"$f":"INDEX(MasterTable[],MATCH(Simulator!$E24,MasterTable[P/N],0),COLUMN(MasterTable['# of Die]))","v":{"$error":"#N/A"}},{"$f":"AL15","v":{"$error":"#N/A"}},{"$f":"INDEX(Tj_to_Vf6[],MATCH(Simulator!$I$8,Tj_to_Vf6[Vf],1),COLUMN(Tj_to_Vf6[Vf]))","v":-0.5},{"$f":"AU15+AV15*AT15","v":{"$error":"#N/A"}},{"$f":"IF(AND(Simulator!$I$8=25,Simulator!$O$12=Simulator!M24),AF15,AR15)","v":{"$error":"#N/A"}}]
[]
["Calculations using Current Input",null,"Converting Tc to Tj",null,null,null,null,"Converting Tj to Tc",null,null,null,null,null,null,null,null,"Calculating Flux",null,null,null,null,null,null,null,null,null,null,null,null,null,null,"Calculating Voltage w/ Tc",null,null,null,null,null,null,null,null,null,null,null,null,null,null,"Calculating Voltage w/ Tj"]
[null,null,"Tj = Tc + Power*Thermal Resistance",null,null,null,null,"Tc = Tj - Power*Thermal Resistance",null,null,null,null,null,null,null,null,"F@Tc&I = Ft*Fr@I*Fr@Tc",null,null,null,null,null,null,null,null,null,null,null,null,null,null,"Vf@Tc&I = Vf@I + Vf@Tc-Vft",null,null,null,null,null,null,null,null,null,null,null,null,null,null,"Vf@Tj&I = Vf@I + Vf@Tj Modifier"]
[null,null,"Tc","Power","Thermal Resistance","Tc>>Tj",null,"Tj","Power","Thermal Resistance","Tj>>Tc",null,"Tc","Tj",{"$f":"IF(Simulator!$L$8=\"Case\",\"Tj\",\"Tc\")","v":"Tj"},null,"Ft","Fr@I Eqn",null,null,null,"Fr@I",null,"Fr@Tc Eqn",null,null,null,"Fr@Tc","F@Tc&I",null,"85 DC Factor","Vft",null,"Vf@I Eqn",null,null,null,"Vf@I","Vf@Tc Eqn",null,null,null,"Vf@Tc","Vf@Tc&I",null,"# of Die","Vf@I","Vf@Tj Modifier, per Die","Vf@Tj&I","Voltage Report"]
[null,"Vero 10",{"$f":"IF(Simulator!$L$8=\"Case\",Simulator!$I$8,M20)","v":25},{"$f":"Simulator!$O$12*AR20/1000","v":5.0478080000000007},{"$f":"INDEX(MasterTable[],MATCH(Simulator!E26,MasterTable[P/N],0),COLUMN(MasterTable[Thermal Resistance]))","v":0.47},{"$f":"C20+D20*E20","v":27.372469760000001},null,{"$f":"IF(Simulator!$L$8=\"Case\",F20,Simulator!$I$8)","v":27.372469760000001},{"$f":"Simulator!$O$12*AW20/1000","v":3.8478080000000001},{"$f":"E20","v":0.47},{"$f":"H20-I20*J20","v":25.564},null,{"$f":"IF(Simulator!$L$8=\"Case\",Simulator!$I$8,K20)","v":25},{"$f":"IF(Simulator!$L$8=\"Case\",H20,Simulator!$I$8)","v":27.372469760000001},{"$f":"IF(#REF!=\"Tj\",N20,M20)","v":{"$error":"#REF!"}},null,{"$f":"INDEX(MasterTable[],MATCH(Simulator!E26,MasterTable[P/N],0),COLUMN(MasterTable[Typical Lumens]))","v":1076},{"$f":"INDEX(MasterTable[],MATCH(Simulator!$E26,MasterTable[P/N],0),COLUMN(MasterTable[I^3]))","v":0},{"$f":"INDEX(MasterTable[],MATCH(Simulator!$E26,MasterTable[P/N],0),COLUMN(MasterTable[I^2]))","v":-9.0240000000000003E-7},{"$f":"INDEX(MasterTable[],MATCH(Simulator!$E26,MasterTable[P/N],0),COLUMN(MasterTable[I]))","v":3.1841790000000001E-3},{"$f":"INDEX(MasterTable[],MATCH(Simulator!$E26,MasterTable[P/N],0),COLUMN(MasterTable[I0]))","v":0},{"$f":"IF(Simulator!$O$12=Simulator!M26,1,S20*Simulator!$O$12^2+T20*Simulator!$O$12+U20)","v":0.60073980000000005},{"$f":"INDEX(MasterTable[],MATCH(Simulator!$E26,MasterTable[P/N],0),COLUMN(MasterTable[F^4]))","v":0},{"$f":"INDEX(MasterTable[],MATCH(Simulator!$E26,MasterTable[P/N],0),COLUMN(MasterTable[F^3]))","v":0},{"$f":"INDEX(MasterTable[],MATCH(Simulator!$E26,MasterTable[P/N],0),COLUMN(MasterTable[F^2]))","v":-6.2593999999999997E-6},{"$f":"INDEX(MasterTable[],MATCH(Simulator!$E26,MasterTable[P/N],0),COLUMN(MasterTable[F]))","v":-1.184453E-3},{"$f":"INDEX(MasterTable[],MATCH(Simulator!$E26,MasterTable[P/N],0),COLUMN(MasterTable[F0]))","v":1.0315523711000001},{"$f":"IF(Simulator!$I$8=85,Calculations!AE20,W20*M20^4+X20*M20^3+Y20*M20^2+Z20*M20+AA20)","v":0.99802892110000008},{"$f":"Q20*V20*AB20","v":645.12192723447299},{"$f":"IF(AND(Simulator!$I$8=85,Simulator!$O$12=Simulator!M26),Q20*AE20,AC20)","v":645.12192723447299},{"$f":"VLOOKUP(MID(Simulator!E26,6,3),Vero10_85DC_Factor,2,FALSE)","v":0.88565000000000005},{"$f":"INDEX(MasterTable[],MATCH(Simulator!$E26,MasterTable[P/N],0),COLUMN(MasterTable[Typical Voltage]))","v":26.5},{"$f":"INDEX(MasterTable[],MATCH(Simulator!$E26,MasterTable[P/N],0),COLUMN(MasterTable[V^4]))","v":-3.2099999999999998E-11},{"$f":"INDEX(MasterTable[],MATCH(Simulator!$E26,MasterTable[P/N],0),COLUMN(MasterTable[V^3]))","v":5.4800000000000001E-8},{"$f":"INDEX(MasterTable[],MATCH(Simulator!$E26,MasterTable[P/N],0),COLUMN(MasterTable[V^2]))","v":-3.5200000000000002E-5},{"$f":"INDEX(MasterTable[],MATCH(Simulator!$E26,MasterTable[P/N],0),COLUMN(MasterTable[V]))","v":1.78E-2},{"$f":"INDEX(MasterTable[],MATCH(Simulator!$E26,MasterTable[P/N],0),COLUMN(MasterTable[V0]))","v":22.7},{"$f":"AG20*Simulator!$O$12^4+AH20*Simulator!$O$12^3+AI20*Simulator!$O$12^2+AJ20*Simulator!$O$12+AK20","v":25.239039999999999},{"$f":"INDEX(MasterTable[],MATCH(Simulator!$E26,MasterTable[P/N],0),COLUMN(MasterTable[T^3]))","v":0},{"$f":"INDEX(MasterTable[],MATCH(Simulator!$E26,MasterTable[P/N],0),COLUMN(MasterTable[T^2]))","v":0},{"$f":"INDEX(MasterTable[],MATCH(Simulator!$E26,MasterTable[P/N],0),COLUMN(MasterTable[T]))","v":-1.4E-2},{"$f":"INDEX(MasterTable[],MATCH(Simulator!$E26,MasterTable[P/N],0),COLUMN(MasterTable[T0]))","v":26.85},{"$f":"AM20*M20^3+AN20*M20^2+AO20*M20+AP20","v":26.5},{"$f":"AL20+AQ20-AF20","v":25.239040000000003},null,{"$f":"INDEX(MasterTable[],MATCH(Simulator!$E26,MasterTable[P/N],0),COLUMN(MasterTable['# of Die]))","v":12},{"$f":"AL20","v":25.239039999999999},{"$f":"INDEX(Tj_to_Vf6[],MATCH(Simulator!$I$8,Tj_to_Vf6[Vf],1),COLUMN(Tj_to_Vf6[Vf]))","v":-0.5},{"$f":"AU20+AV20*AT20","v":19.239039999999999},{"$f":"IF(AND(Simulator!$I$8=25,Simulator!$O$12=Simulator!M26),AF20,AR20)","v":25.239040000000003}]
[null,"Vero 13",{"$f":"IF(Simulator!$L$8=\"Case\",Simulator!$I$8,M21)","v":25},{"$f":"Simulator!$O$12*AR21/1000","v":6.0728424582825937},{"$f":"INDEX(MasterTable[],MATCH(Simulator!E27,MasterTable[P/N],0),COLUMN(MasterTable[Thermal Resistance]))","v":0.22},{"$f":"C21+D21*E21","v":26.336025340822172},null,{"$f":"IF(Simulator!$L$8=\"Case\",F21,Simulator!$I$8)","v":26.336025340822172},{"$f":"Simulator!$O$12*AW21/1000","v":2.7728424582825926},{"$f":"E21","v":0.22},{"$f":"H21-I21*J21","v":25.726000000000003},null,{"$f":"IF(Simulator!$L$8=\"Case\",Simulator!$I$8,K21)","v":25},{"$f":"IF(Simulator!$L$8=\"Case\",H21,Simulator!$I$8)","v":26.336025340822172},{"$f":"IF(#REF!=\"Tj\",N21,M21)","v":{"$error":"#REF!"}},null,{"$f":"INDEX(MasterTable[],MATCH(Simulator!E27,MasterTable[P/N],0),COLUMN(MasterTable[Typical Lumens]))","v":1900},{"$f":"INDEX(MasterTable[],MATCH(Simulator!$E27,MasterTable[P/N],0),COLUMN(MasterTable[I^3]))","v":0},{"$f":"INDEX(MasterTable[],MATCH(Simulator!$E27,MasterTable[P/N],0),COLUMN(MasterTable[I^2]))","v":-5.2056577008E-7},{"$f":"INDEX(MasterTable[],MATCH(Simulator!$E27,MasterTable[P/N],0),COLUMN(MasterTable[I]))","v":2.2529763468E-3},{"$f":"INDEX(MasterTable[],MATCH(Simulator!$E27,MasterTable[P/N],0),COLUMN(MasterTable[I0]))","v":4.8311928226E-3},{"$f":"IF(Simulator!$O$12=Simulator!M27,1,S21*Simulator!$O$12^2+T21*Simulator!$O$12+U21)","v":0.43460383137939995},{"$f":"INDEX(MasterTable[],MATCH(Simulator!$E27,MasterTable[P/N],0),COLUMN(MasterTable[F^4]))","v":0},{"$f":"INDEX(MasterTable[],MATCH(Simulator!$E27,MasterTable[P/N],0),COLUMN(MasterTable[F^3]))","v":-1.02E-7},{"$f":"INDEX(MasterTable[],MATCH(Simulator!$E27,MasterTable[P/N],0),COLUMN(MasterTable[F^2]))","v":1.27E-5},{"$f":"INDEX(MasterTable[],MATCH(Simulator!$E27,MasterTable[P/N],0),COLUMN(MasterTable[F]))","v":-2.0200000000000001E-3},{"$f":"INDEX(MasterTable[],MATCH(Simulator!$E27,MasterTable[P/N],0),COLUMN(MasterTable[F0]))","v":1.04},{"$f":"W21*M21^4+X21*M21^3+Y21*M21^2+Z21*M21+AA21","v":0.99584375000000003},{"$f":"Q21*V21*AB21","v":822.31526748993576},{"$f":"AC21","v":822.31526748993576},{"$f":"VLOOKUP(MID(Simulator!E27,6,3),Vero13_85DC_Factor,2,FALSE)","v":0.88},{"$f":"INDEX(MasterTable[],MATCH(Simulator!$E27,MasterTable[P/N],0),COLUMN(MasterTable[Typical Voltage]))","v":32.299999999999997},{"$f":"INDEX(MasterTable[],MATCH(Simulator!$E27,MasterTable[P/N],0),COLUMN(MasterTable[V^4]))","v":-9.5076604018999997E-12},{"$f":"INDEX(MasterTable[],MATCH(Simulator!$E27,MasterTable[P/N],0),COLUMN(MasterTable[V^3]))","v":2.4428286607E-8},{"$f":"INDEX(MasterTable[],MATCH(Simulator!$E27,MasterTable[P/N],0),COLUMN(MasterTable[V^2]))","v":-2.3169246580000001E-5},{"$f":"INDEX(MasterTable[],MATCH(Simulator!$E27,MasterTable[P/N],0),COLUMN(MasterTable[V]))","v":1.4970494217E-2},{"$f":"INDEX(MasterTable[],MATCH(Simulator!$E27,MasterTable[P/N],0),COLUMN(MasterTable[V0]))","v":28.116669275},{"$f":"AG21*Simulator!$O$12^4+AH21*Simulator!$O$12^3+AI21*Simulator!$O$12^2+AJ21*Simulator!$O$12+AK21","v":30.364212291412962},{"$f":"INDEX(MasterTable[],MATCH(Simulator!$E27,MasterTable[P/N],0),COLUMN(MasterTable[T^3]))","v":0},{"$f":"INDEX(MasterTable[],MATCH(Simulator!$E27,MasterTable[P/N],0),COLUMN(MasterTable[T^2]))","v":0},{"$f":"INDEX(MasterTable[],MATCH(Simulator!$E27,MasterTable[P/N],0),COLUMN(MasterTable[T]))","v":-1.7000000000000001E-2},{"$f":"INDEX(MasterTable[],MATCH(Simulator!$E27,MasterTable[P/N],0),COLUMN(MasterTable[T0]))","v":32.725000000000001},32.300000000000004,{"$f":"AL21+AQ21-AF21","v":30.364212291412969},null,{"$f":"INDEX(MasterTable[],MATCH(Simulator!$E27,MasterTable[P/N],0),COLUMN(MasterTable['# of Die]))","v":33},{"$f":"AL21","v":30.364212291412962},{"$f":"INDEX(Tj_to_Vf6[],MATCH(Simulator!$I$8,Tj_to_Vf6[Vf],1),COLUMN(Tj_to_Vf6[Vf]))","v":-0.5},{"$f":"AU21+AV21*AT21","v":13.864212291412962},{"$f":"IF(AND(Simulator!$I$8=25,Simulator!$O$12=Simulator!M27),AF21,AR21)","v":30.364212291412969}]
[null,"Vero 18",{"$f":"IF(Simulator!$L$8=\"Case\",Simulator!$I$8,M22)","v":25},{"$f":"Simulator!$O$12*AR22/1000","v":5.3436754521072771},{"$f":"INDEX(MasterTable[],MATCH(Simulator!E28,MasterTable[P/N],0),COLUMN(MasterTable[Thermal Resistance]))","v":0.13},{"$f":"C22+D22*E22","v":25.694677808773946},null,{"$f":"IF(Simulator!$L$8=\"Case\",F22,Simulator!$I$8)","v":25.694677808773946},{"$f":"Simulator!$O$12*AW22/1000","v":-0.65632454789272354},{"$f":"E22","v":0.13},{"$f":"H22-I22*J22","v":25.78},null,{"$f":"IF(Simulator!$L$8=\"Case\",Simulator!$I$8,K22)","v":25},{"$f":"IF(Simulator!$L$8=\"Case\",H22,Simulator!$I$8)","v":25.694677808773946},{"$f":"IF(#REF!=\"Tj\",N22,M22)","v":{"$error":"#REF!"}},null,{"$f":"INDEX(MasterTable[],MATCH(Simulator!E28,MasterTable[P/N],0),COLUMN(MasterTable[Typical Lumens]))","v":3670},{"$f":"INDEX(MasterTable[],MATCH(Simulator!$E28,MasterTable[P/N],0),COLUMN(MasterTable[I^3]))","v":0},{"$f":"INDEX(MasterTable[],MATCH(Simulator!$E28,MasterTable[P/N],0),COLUMN(MasterTable[I^2]))","v":-1.3106025059999999E-7},{"$f":"INDEX(MasterTable[],MATCH(Simulator!$E28,MasterTable[P/N],0),COLUMN(MasterTable[I]))","v":1.0878699984E-3},{"$f":"INDEX(MasterTable[],MATCH(Simulator!$E28,MasterTable[P/N],0),COLUMN(MasterTable[I0]))","v":4.2883455537999996E-3},{"$f":"IF(Simulator!$O$12=Simulator!M28,1,S22*Simulator!$O$12^2+T22*Simulator!$O$12+U22)","v":0.21661993520980002},{"$f":"INDEX(MasterTable[],MATCH(Simulator!$E28,MasterTable[P/N],0),COLUMN(MasterTable[F^4]))","v":0},{"$f":"INDEX(MasterTable[],MATCH(Simulator!$E28,MasterTable[P/N],0),COLUMN(MasterTable[F^3]))","v":-1.8425800000000001E-7},{"$f":"INDEX(MasterTable[],MATCH(Simulator!$E28,MasterTable[P/N],0),COLUMN(MasterTable[F^2]))","v":2.5068200000000002E-5},{"$f":"INDEX(MasterTable[],MATCH(Simulator!$E28,MasterTable[P/N],0),COLUMN(MasterTable[F]))","v":-2.5901499999999998E-3},{"$f":"INDEX(MasterTable[],MATCH(Simulator!$E28,MasterTable[P/N],0),COLUMN(MasterTable[F0]))","v":1.05063},{"$f":"W22*M22^4+X22*M22^3+Y22*M22^2+Z22*M22+AA22","v":0.99866484374999998},793.93371946040838,{"$f":"AC22","v":793.93371946040838},{"$f":"VLOOKUP(MID(Simulator!E28,6,3),Vero18_85DC_Factor,2,FALSE)","v":0.88},{"$f":"INDEX(MasterTable[],MATCH(Simulator!$E28,MasterTable[P/N],0),COLUMN(MasterTable[Typical Voltage]))","v":29.5},{"$f":"INDEX(MasterTable[],MATCH(Simulator!$E28,MasterTable[P/N],0),COLUMN(MasterTable[V^4]))","v":-4.3296141676000001E-13},{"$f":"INDEX(MasterTable[],MATCH(Simulator!$E28,MasterTable[P/N],0),COLUMN(MasterTable[V^3]))","v":2.4210131023999999E-9},{"$f":"INDEX(MasterTable[],MATCH(Simulator!$E28,MasterTable[P/N],0),COLUMN(MasterTable[V^2]))","v":-5.0293161703999997E-6},{"$f":"INDEX(MasterTable[],MATCH(Simulator!$E28,MasterTable[P/N],0),COLUMN(MasterTable[V]))","v":6.8884526139999999E-3},{"$f":"INDEX(MasterTable[],MATCH(Simulator!$E28,MasterTable[P/N],0),COLUMN(MasterTable[V0]))","v":25.523184017999998},{"$f":"AG22*Simulator!$O$12^4+AH22*Simulator!$O$12^3+AI22*Simulator!$O$12^2+AJ22*Simulator!$O$12+AK22","v":26.718377260536382},{"$f":"INDEX(MasterTable[],MATCH(Simulator!$E28,MasterTable[P/N],0),COLUMN(MasterTable[T^3]))","v":0},{"$f":"INDEX(MasterTable[],MATCH(Simulator!$E28,MasterTable[P/N],0),COLUMN(MasterTable[T^2]))","v":0},{"$f":"INDEX(MasterTable[],MATCH(Simulator!$E28,MasterTable[P/N],0),COLUMN(MasterTable[T]))","v":-1.4999999999999999E-2},{"$f":"INDEX(MasterTable[],MATCH(Simulator!$E28,MasterTable[P/N],0),COLUMN(MasterTable[T0]))","v":29.875},{"$f":"AM22*M22^3+AN22*M22^2+AO22*M22+AP22","v":29.5},26.718377260536386,null,{"$f":"INDEX(MasterTable[],MATCH(Simulator!$E28,MasterTable[P/N],0),COLUMN(MasterTable['# of Die]))","v":60},{"$f":"AL22","v":26.718377260536382},{"$f":"INDEX(Tj_to_Vf6[],MATCH(Simulator!$I$8,Tj_to_Vf6[Vf],1),COLUMN(Tj_to_Vf6[Vf]))","v":-0.5},{"$f":"AU22+AV22*AT22","v":-3.2816227394636179},{"$f":"IF(AND(Simulator!$I$8=25,Simulator!$O$12=Simulator!M28),AF22,AR22)","v":26.718377260536386}]
[null,"Vero 29",{"$f":"IF(Simulator!$L$8=\"Case\",Simulator!$I$8,M23)","v":25},{"$f":"Simulator!$O$12*AR23/1000","v":6.7324865378567385},{"$f":"INDEX(MasterTable[],MATCH(Simulator!E29,MasterTable[P/N],0),COLUMN(MasterTable[Thermal Resistance]))","v":0.06},{"$f":"C23+D23*E23","v":25.403949192271405},null,{"$f":"IF(Simulator!$L$8=\"Case\",F23,Simulator!$I$8)","v":25.403949192271405},{"$f":"Simulator!$O$12*AW23/1000","v":-8.867513462143263},{"$f":"E23","v":0.06},{"$f":"H23-I23*J23","v":25.936},null,{"$f":"IF(Simulator!$L$8=\"Case\",Simulator!$I$8,K23)","v":25},{"$f":"IF(Simulator!$L$8=\"Case\",H23,Simulator!$I$8)","v":25.403949192271405},{"$f":"IF(#REF!=\"Tj\",N23,M23)","v":{"$error":"#REF!"}},null,{"$f":"INDEX(MasterTable[],MATCH(Simulator!E29,MasterTable[P/N],0),COLUMN(MasterTable[Typical Lumens]))","v":9415},{"$f":"INDEX(MasterTable[],MATCH(Simulator!$E29,MasterTable[P/N],0),COLUMN(MasterTable[I^3]))","v":0},{"$f":"INDEX(MasterTable[],MATCH(Simulator!$E29,MasterTable[P/N],0),COLUMN(MasterTable[I^2]))","v":-3.6683947658000001E-8},{"$f":"INDEX(MasterTable[],MATCH(Simulator!$E29,MasterTable[P/N],0),COLUMN(MasterTable[I]))","v":5.5936581253000002E-4},{"$f":"INDEX(MasterTable[],MATCH(Simulator!$E29,MasterTable[P/N],0),COLUMN(MasterTable[I0]))","v":0},{"$f":"IF(Simulator!$O$12=Simulator!M29,1,S23*Simulator!$O$12^2+T23*Simulator!$O$12+U23)","v":0.11040580459968001},{"$f":"INDEX(MasterTable[],MATCH(Simulator!$E29,MasterTable[P/N],0),COLUMN(MasterTable[F^4]))","v":-4.0380200000000001E-9},{"$f":"INDEX(MasterTable[],MATCH(Simulator!$E29,MasterTable[P/N],0),COLUMN(MasterTable[F^3]))","v":6.48277E-7},{"$f":"INDEX(MasterTable[],MATCH(Simulator!$E29,MasterTable[P/N],0),COLUMN(MasterTable[F^2]))","v":-3.1828400000000002E-5},{"$f":"INDEX(MasterTable[],MATCH(Simulator!$E29,MasterTable[P/N],0),COLUMN(MasterTable[F]))","v":-1.1693700000000001E-3},{"$f":"INDEX(MasterTable[],MATCH(Simulator!$E29,MasterTable[P/N],0),COLUMN(MasterTable[F0]))","v":1.0407900000000001},1.0002149765625001,1039.6941121332097,1039.6941121332097,{"$f":"VLOOKUP(MID(Simulator!E29,6,3),Vero29_85DC_Factor,2,FALSE)","v":0.88},{"$f":"INDEX(MasterTable[],MATCH(Simulator!$E29,MasterTable[P/N],0),COLUMN(MasterTable[Typical Voltage]))","v":38},{"$f":"INDEX(MasterTable[],MATCH(Simulator!$E29,MasterTable[P/N],0),COLUMN(MasterTable[V^4]))","v":-5.0696360042000002E-14},{"$f":"INDEX(MasterTable[],MATCH(Simulator!$E29,MasterTable[P/N],0),COLUMN(MasterTable[V^3]))","v":5.0223240997000004E-10},{"$f":"INDEX(MasterTable[],MATCH(Simulator!$E29,MasterTable[P/N],0),COLUMN(MasterTable[V^2]))","v":-1.857052826E-6},{"$f":"INDEX(MasterTable[],MATCH(Simulator!$E29,MasterTable[P/N],0),COLUMN(MasterTable[V]))","v":4.6475978560999998E-3},{"$f":"INDEX(MasterTable[],MATCH(Simulator!$E29,MasterTable[P/N],0),COLUMN(MasterTable[V0]))","v":32.803258485999997},{"$f":"AG23*Simulator!$O$12^4+AH23*Simulator!$O$12^3+AI23*Simulator!$O$12^2+AJ23*Simulator!$O$12+AK23","v":33.66243268928369},{"$f":"INDEX(MasterTable[],MATCH(Simulator!$E29,MasterTable[P/N],0),COLUMN(MasterTable[T^3]))","v":0},{"$f":"INDEX(MasterTable[],MATCH(Simulator!$E29,MasterTable[P/N],0),COLUMN(MasterTable[T^2]))","v":0},{"$f":"INDEX(MasterTable[],MATCH(Simulator!$E29,MasterTable[P/N],0),COLUMN(MasterTable[T]))","v":-0.02},{"$f":"INDEX(MasterTable[],MATCH(Simulator!$E29,MasterTable[P/N],0),COLUMN(MasterTable[T0]))","v":38.5},38,33.66243268928369,null,{"$f":"INDEX(MasterTable[],MATCH(Simulator!$E29,MasterTable[P/N],0),COLUMN(MasterTable['# of Die]))","v":156},{"$f":"AL23","v":33.66243268928369},{"$f":"INDEX(Tj_to_Vf6[],MATCH(Simulator!$I$8,Tj_to_Vf6[Vf],1),COLUMN(Tj_to_Vf6[Vf]))","v":-0.5},{"$f":"AU23+AV23*AT23","v":-44.33756731071631},{"$f":"IF(AND(Simulator!$I$8=25,Simulator!$O$12=Simulator!M29),AF23,AR23)","v":33.66243268928369}]
[]
["Calculations using Current Input",null,"Converting Tc to Tj",null,null,null,null,"Converting Tj to Tc",null,null,null,null,null,null,null,null,"Calculating Flux",null,null,null,null,null,null,null,null,null,null,null,null,null,null,"Calculating Voltage w/ Tc",null,null,null,null,null,null,null,null,null,null,null,null,null,null,"Calculating Voltage w/ Tj"]
[null,null,"Tj = Tc + Power*Thermal Resistance",null,null,null,null,"Tc = Tj - Power*Thermal Resistance",null,null,null,null,null,null,null,null,"F@Tc&I = Ft*Fr@I*Fr@Tc",null,null,null,null,null,null,null,null,null,null,null,null,null,null,"Vf@Tc&I = Vf@I + Vf@Tc-Vft",null,null,null,null,null,null,null,null,null,null,null,null,null,null,"Vf@Tj&I = Vf@I + Vf@Tj Modifier"]
[null,null,"Tc","Power","Thermal Resistance","Tc>>Tj",null,"Tj","Power","Thermal Resistance","Tj>>Tc",null,"Tc","Tj",{"$f":"IF(Simulator!$L$8=\"Case\",\"Tj\",\"Tc\")","v":"Tj"},null,"Ft","Fr@I Eqn",null,null,null,"Fr@I",null,"Fr@Tc Eqn",null,null,null,"Fr@Tc","F@Tc&I",null,"85 DC Factor","Vft",null,"Vf@I Eqn",null,null,null,"Vf@I","Vf@Tc Eqn",null,null,null,"Vf@Tc","Vf@Tc&I",null,"# of Die","Vf@I","Vf@Tj Modifier, per Die","Vf@Tj&I","Voltage Report"]
[null,"H6",{"$f":"IF(Simulator!$L$8=\"Case\",Simulator!$I$8,M28)","v":25},{"$f":"Simulator!$O$12*AR28/1000","v":{"$error":"#N/A"}},{"$f":"INDEX(MasterTable[],MATCH(Simulator!E31,MasterTable[P/N],0),COLUMN(MasterTable[Thermal Resistance]))","v":{"$error":"#N/A"}},{"$f":"C28+D28*E28","v":{"$error":"#N/A"}},null,{"$f":"IF(Simulator!$L$8=\"Case\",F28,Simulator!$I$8)","v":{"$error":"#N/A"}},{"$f":"Simulator!$O$12*AW28/1000","v":{"$error":"#N/A"}},{"$f":"E28","v":{"$error":"#N/A"}},{"$f":"H28-I28*J28","v":{"$error":"#N/A"}},null,{"$f":"IF(Simulator!$L$8=\"Case\",Simulator!$I$8,K28)","v":25},{"$f":"IF(Simulator!$L$8=\"Case\",H28,Simulator!$I$8)","v":{"$error":"#N/A"}},{"$f":"IF(#REF!=\"Tj\",N28,M28)","v":{"$error":"#REF!"}},null,{"$f":"INDEX(MasterTable[],MATCH(Simulator!E31,MasterTable[P/N],0),COLUMN(MasterTable[Typical Lumens]))","v":{"$error":"#N/A"}},{"$f":"INDEX(MasterTable[],MATCH(Simulator!$E31,MasterTable[P/N],0),COLUMN(MasterTable[I^3]))","v":{"$error":"#N/A"}},{"$f":"INDEX(MasterTable[],MATCH(Simulator!$E31,MasterTable[P/N],0),COLUMN(MasterTable[I^2]))","v":{"$error":"#N/A"}},{"$f":"INDEX(MasterTable[],MATCH(Simulator!$E31,MasterTable[P/N],0),COLUMN(MasterTable[I]))","v":{"$error":"#N/A"}},{"$f":"INDEX(MasterTable[],MATCH(Simulator!$E31,MasterTable[P/N],0),COLUMN(MasterTable[I0]))","v":{"$error":"#N/A"}},{"$f":"IF(Simulator!$O$12=Simulator!M31,1,S28*Simulator!$O$12^2+T28*Simulator!$O$12+U28)","v":{"$error":"#N/A"}},{"$f":"INDEX(MasterTable[],MATCH(Simulator!$E31,MasterTable[P/N],0),COLUMN(MasterTable[F^4]))","v":{"$error":"#N/A"}},{"$f":"INDEX(MasterTable[],MATCH(Simulator!$E31,MasterTable[P/N],0),COLUMN(MasterTable[F^3]))","v":{"$error":"#N/A"}},{"$f":"INDEX(MasterTable[],MATCH(Simulator!$E31,MasterTable[P/N],0),COLUMN(MasterTable[F^2]))","v":{"$error":"#N/A"}},{"$f":"INDEX(MasterTable[],MATCH(Simulator!$E31,MasterTable[P/N],0),COLUMN(MasterTable[F]))","v":{"$error":"#N/A"}},{"$f":"INDEX(MasterTable[],MATCH(Simulator!$E31,MasterTable[P/N],0),COLUMN(MasterTable[F0]))","v":{"$error":"#N/A"}},{"$f":"IF(Simulator!$I$8=85,Calculations!AE28,W28*M28^4+X28*M28^3+Y28*M28^2+Z28*M28+AA28)","v":{"$error":"#N/A"}},{"$f":"Q28*V28*AB28","v":{"$error":"#N/A"}},{"$f":"IF(AND(Simulator!$I$8=85,Simulator!$O$12=Simulator!M40),Q28*AE28,AC28)","v":{"$error":"#N/A"}},{"$f":"VLOOKUP(MID(Simulator!E31,6,3),Data!$G$61:$H$65,2,FALSE)","v":{"$error":"#N/A"}},{"$f":"INDEX(MasterTable[],MATCH(Simulator!$E31,MasterTable[P/N],0),COLUMN(MasterTable[Typical Voltage]))","v":{"$error":"#N/A"}},{"$f":"INDEX(MasterTable[],MATCH(Simulator!$E31,MasterTable[P/N],0),COLUMN(MasterTable[V^4]))","v":{"$error":"#N/A"}},{"$f":"INDEX(MasterTable[],MATCH(Simulator!$E31,MasterTable[P/N],0),COLUMN(MasterTable[V^3]))","v":{"$error":"#N/A"}},{"$f":"INDEX(MasterTable[],MATCH(Simulator!$E31,MasterTable[P/N],0),COLUMN(MasterTable[V^2]))","v":{"$error":"#N/A"}},{"$f":"INDEX(MasterTable[],MATCH(Simulator!$E31,MasterTable[P/N],0),COLUMN(MasterTable[V]))","v":{"$error":"#N/A"}},{"$f":"INDEX(MasterTable[],MATCH(Simulator!$E31,MasterTable[P/N],0),COLUMN(MasterTable[V0]))","v":{"$error":"#N/A"}},{"$f":"AG28*Simulator!$O$12^4+AH28*Simulator!$O$12^3+AI28*Simulator!$O$12^2+AJ28*Simulator!$O$12+AK28","v":{"$error":"#N/A"}},{"$f":"INDEX(MasterTable[],MATCH(Simulator!$E31,MasterTable[P/N],0),COLUMN(MasterTable[T^3]))","v":{"$error":"#N/A"}},{"$f":"INDEX(MasterTable[],MATCH(Simulator!$E31,MasterTable[P/N],0),COLUMN(MasterTable[T^2]))","v":{"$error":"#N/A"}},{"$f":"INDEX(MasterTable[],MATCH(Simulator!$E31,MasterTable[P/N],0),COLUMN(MasterTable[T]))","v":{"$error":"#N/A"}},{"$f":"INDEX(MasterTable[],MATCH(Simulator!$E31,MasterTable[P/N],0),COLUMN(MasterTable[T0]))","v":{"$error":"#N/A"}},{"$f":"AM28*M28^3+AN28*M28^2+AO28*M28+AP28","v":{"$error":"#N/A"}},{"$f":"AL28+AQ28-AF28","v":{"$error":"#N/A"}},null,{"$f":"INDEX(MasterTable[],MATCH(Simulator!$E31,MasterTable[P/N],0),COLUMN(MasterTable['# of Die]))","v":{"$error":"#N/A"}},{"$f":"AL28","v":{"$error":"#N/A"}},{"$f":"INDEX(Tj_to_Vf6[],MATCH(Simulator!$I$8,Tj_to_Vf6[Vf],1),COLUMN(Tj_to_Vf6[Vf]))","v":-0.5},{"$f":"AU28+AV28*AT28","v":{"$error":"#N/A"}},{"$f":"IF(AND(Simulator!$I$8=25,Simulator!$O$12=Simulator!M40),AF28,AR28)","v":{"$error":"#N/A"}}]
[null,"H9",{"$f":"IF(Simulator!$L$8=\"Case\",Simulator!$I$8,M29)","v":25},{"$f":"Simulator!$O$12*AR29/1000","v":{"$error":"#N/A"}},{"$f":"INDEX(MasterTable[],MATCH(Simulator!E32,MasterTable[P/N],0),COLUMN(MasterTable[Thermal Resistance]))","v":{"$error":"#N/A"}},{"$f":"C29+D29*E29","v":{"$error":"#N/A"}},null,{"$f":"IF(Simulator!$L$8=\"Case\",F29,Simulator!$I$8)","v":{"$error":"#N/A"}},{"$f":"Simulator!$O$12*AW29/1000","v":{"$error":"#N/A"}},{"$f":"E29","v":{"$error":"#N/A"}},{"$f":"H29-I29*J29","v":{"$error":"#N/A"}},null,{"$f":"IF(Simulator!$L$8=\"Case\",Simulator!$I$8,K29)","v":25},{"$f":"IF(Simulator!$L$8=\"Case\",H29,Simulator!$I$8)","v":{"$error":"#N/A"}},{"$f":"IF(#REF!=\"Tj\",N29,M29)","v":{"$error":"#REF!"}},null,{"$f":"INDEX(MasterTable[],MATCH(Simulator!E32,MasterTable[P/N],0),COLUMN(MasterTable[Typical Lumens]))","v":{"$error":"#N/A"}},{"$f":"INDEX(MasterTable[],MATCH(Simulator!$E32,MasterTable[P/N],0),COLUMN(MasterTable[I^3]))","v":{"$error":"#N/A"}},{"$f":"INDEX(MasterTable[],MATCH(Simulator!$E32,MasterTable[P/N],0),COLUMN(MasterTable[I^2]))","v":{"$error":"#N/A"}},{"$f":"INDEX(MasterTable[],MATCH(Simulator!$E32,MasterTable[P/N],0),COLUMN(MasterTable[I]))","v":{"$error":"#N/A"}},{"$f":"INDEX(MasterTable[],MATCH(Simulator!$E32,MasterTable[P/N],0),COLUMN(MasterTable[I0]))","v":{"$error":"#N/A"}},{"$f":"IF(Simulator!$O$12=Simulator!M32,1,S29*Simulator!$O$12^2+T29*Simulator!$O$12+U29)","v":{"$error":"#N/A"}},{"$f":"INDEX(MasterTable[],MATCH(Simulator!$E32,MasterTable[P/N],0),COLUMN(MasterTable[F^4]))","v":{"$error":"#N/A"}},{"$f":"INDEX(MasterTable[],MATCH(Simulator!$E32,MasterTable[P/N],0),COLUMN(MasterTable[F^3]))","v":{"$error":"#N/A"}},{"$f":"INDEX(MasterTable[],MATCH(Simulator!$E32,MasterTable[P/N],0),COLUMN(MasterTable[F^2]))","v":{"$error":"#N/A"}},{"$f":"INDEX(MasterTable[],MATCH(Simulator!$E32,MasterTable[P/N],0),COLUMN(MasterTable[F]))","v":{"$error":"#N/A"}},{"$f":"INDEX(MasterTable[],MATCH(Simulator!$E32,MasterTable[P/N],0),COLUMN(MasterTable[F0]))","v":{"$error":"#N/A"}},{"$f":"IF(Simulator!$I$8=85,Calculations!AE29,W29*M29^4+X29*M29^3+Y29*M29^2+Z29*M29+AA29)","v":{"$error":"#N/A"}},{"$f":"Q29*V29*AB29","v":{"$error":"#N/A"}},{"$f":"IF(AND(Simulator!$I$8=85,Simulator!$O$12=Simulator!M41),Q29*AE29,AC29)","v":{"$error":"#N/A"}},{"$f":"VLOOKUP(MID(Simulator!E32,6,3),Data!$J$61:$K$65,2,FALSE)","v":{"$error":"#N/A"}},{"$f":"INDEX(MasterTable[],MATCH(Simulator!$E32,MasterTable[P/N],0),COLUMN(MasterTable[Typical Voltage]))","v":{"$error":"#N/A"}},{"$f":"INDEX(MasterTable[],MATCH(Simulator!$E32,MasterTable[P/N],0),COLUMN(MasterTable[V^4]))","v":{"$error":"#N/A"}},{"$f":"INDEX(MasterTable[],MATCH(Simulator!$E32,MasterTable[P/N],0),COLUMN(MasterTable[V^3]))","v":{"$error":"#N/A"}},{"$f":"INDEX(MasterTable[],MATCH(Simulator!$E32,MasterTable[P/N],0),COLUMN(MasterTable[V^2]))","v":{"$error":"#N/A"}},{"$f":"INDEX(MasterTable[],MATCH(Simulator!$E32,MasterTable[P/N],0),COLUMN(MasterTable[V]))","v":{"$error":"#N/A"}},{"$f":"INDEX(MasterTable[],MATCH(Simulator!$E32,MasterTable[P/N],0),COLUMN(MasterTable[V0]))","v":{"$error":"#N/A"}},{"$f":"AG29*Simulator!$O$12^4+AH29*Simulator!$O$12^3+AI29*Simulator!$O$12^2+AJ29*Simulator!$O$12+AK29","v":{"$error":"#N/A"}},{"$f":"INDEX(MasterTable[],MATCH(Simulator!$E32,MasterTable[P/N],0),COLUMN(MasterTable[T^3]))","v":{"$error":"#N/A"}},{"$f":"INDEX(MasterTable[],MATCH(Simulator!$E32,MasterTable[P/N],0),COLUMN(MasterTable[T^2]))","v":{"$error":"#N/A"}},{"$f":"INDEX(MasterTable[],MATCH(Simulator!$E32,MasterTable[P/N],0),COLUMN(MasterTable[T]))","v":{"$error":"#N/A"}},{"$f":"INDEX(MasterTable[],MATCH(Simulator!$E32,MasterTable[P/N],0),COLUMN(MasterTable[T0]))","v":{"$error":"#N/A"}},{"$f":"AM29*M29^3+AN29*M29^2+AO29*M29+AP29","v":{"$error":"#N/A"}},{"$f":"AL29+AQ29-AF29","v":{"$error":"#N/A"}},null,{"$f":"INDEX(MasterTable[],MATCH(Simulator!$E32,MasterTable[P/N],0),COLUMN(MasterTable['# of Die]))","v":{"$error":"#N/A"}},{"$f":"AL29","v":{"$error":"#N/A"}},{"$f":"INDEX(Tj_to_Vf6[],MATCH(Simulator!$I$8,Tj_to_Vf6[Vf],1),COLUMN(Tj_to_Vf6[Vf]))","v":-0.5},{"$f":"AU29+AV29*AT29","v":{"$error":"#N/A"}},{"$f":"IF(AND(Simulator!$I$8=25,Simulator!$O$12=Simulator!M41),AF29,AR29)","v":{"$error":"#N/A"}}]
[null,"H12",{"$f":"IF(Simulator!$L$8=\"Case\",Simulator!$I$8,M30)","v":25},{"$f":"Simulator!$O$12*AR30/1000","v":{"$error":"#N/A"}},{"$f":"INDEX(MasterTable[],MATCH(Simulator!E33,MasterTable[P/N],0),COLUMN(MasterTable[Thermal Resistance]))","v":{"$error":"#N/A"}},{"$f":"C30+D30*E30","v":{"$error":"#N/A"}},null,{"$f":"IF(Simulator!$L$8=\"Case\",F30,Simulator!$I$8)","v":{"$error":"#N/A"}},{"$f":"Simulator!$O$12*AW30/1000","v":{"$error":"#N/A"}},{"$f":"E30","v":{"$error":"#N/A"}},{"$error":"#N/A"},null,{"$f":"IF(Simulator!$L$8=\"Case\",Simulator!$I$8,K30)","v":25},{"$f":"IF(Simulator!$L$8=\"Case\",H30,Simulator!$I$8)","v":{"$error":"#N/A"}},{"$f":"IF(#REF!=\"Tj\",N30,M30)","v":{"$error":"#REF!"}},null,{"$f":"INDEX(MasterTable[],MATCH(Simulator!E33,MasterTable[P/N],0),COLUMN(MasterTable[Typical Lumens]))","v":{"$error":"#N/A"}},{"$f":"INDEX(MasterTable[],MATCH(Simulator!$E33,MasterTable[P/N],0),COLUMN(MasterTable[I^3]))","v":{"$error":"#N/A"}},{"$f":"INDEX(MasterTable[],MATCH(Simulator!$E33,MasterTable[P/N],0),COLUMN(MasterTable[I^2]))","v":{"$error":"#N/A"}},{"$f":"INDEX(MasterTable[],MATCH(Simulator!$E33,MasterTable[P/N],0),COLUMN(MasterTable[I]))","v":{"$error":"#N/A"}},{"$f":"INDEX(MasterTable[],MATCH(Simulator!$E33,MasterTable[P/N],0),COLUMN(MasterTable[I0]))","v":{"$error":"#N/A"}},{"$f":"IF(Simulator!$O$12=Simulator!M33,1,S30*Simulator!$O$12^2+T30*Simulator!$O$12+U30)","v":{"$error":"#N/A"}},{"$f":"INDEX(MasterTable[],MATCH(Simulator!$E33,MasterTable[P/N],0),COLUMN(MasterTable[F^4]))","v":{"$error":"#N/A"}},{"$f":"INDEX(MasterTable[],MATCH(Simulator!$E33,MasterTable[P/N],0),COLUMN(MasterTable[F^3]))","v":{"$error":"#N/A"}},{"$f":"INDEX(MasterTable[],MATCH(Simulator!$E33,MasterTable[P/N],0),COLUMN(MasterTable[F^2]))","v":{"$error":"#N/A"}},{"$f":"INDEX(MasterTable[],MATCH(Simulator!$E33,MasterTable[P/N],0),COLUMN(MasterTable[F]))","v":{"$error":"#N/A"}},{"$f":"INDEX(MasterTable[],MATCH(Simulator!$E33,MasterTable[P/N],0),COLUMN(MasterTable[F0]))","v":{"$error":"#N/A"}},{"$f":"IF(Simulator!$I$8=85,Calculations!AE30,W30*M30^4+X30*M30^3+Y30*M30^2+Z30*M30+AA30)","v":{"$error":"#N/A"}},{"$f":"Q30*V30*AB30","v":{"$error":"#N/A"}},{"$f":"IF(AND(Simulator!$I$8=85,Simulator!$O$12=Simulator!M42),Q30*AE30,AC30)","v":{"$error":"#N/A"}},{"$f":"VLOOKUP(MID(Simulator!E33,6,3),Data!$M$61:$N$65,2,FALSE)","v":{"$error":"#N/A"}},{"$f":"INDEX(MasterTable[],MATCH(Simulator!$E33,MasterTable[P/N],0),COLUMN(MasterTable[Typical Voltage]))","v":{"$error":"#N/A"}},{"$f":"INDEX(MasterTable[],MATCH(Simulator!$E33,MasterTable[P/N],0),COLUMN(MasterTable[V^4]))","v":{"$error":"#N/A"}},{"$f":"INDEX(MasterTable[],MATCH(Simulator!$E33,MasterTable[P/N],0),COLUMN(MasterTable[V^3]))","v":{"$error":"#N/A"}},{"$f":"INDEX(MasterTable[],MATCH(Simulator!$E33,MasterTable[P/N],0),COLUMN(MasterTable[V^2]))","v":{"$error":"#N/A"}},{"$f":"INDEX(MasterTable[],MATCH(Simulator!$E33,MasterTable[P/N],0),COLUMN(MasterTable[V]))","v":{"$error":"#N/A"}},{"$f":"INDEX(MasterTable[],MATCH(Simulator!$E33,MasterTable[P/N],0),COLUMN(MasterTable[V0]))","v":{"$error":"#N/A"}},{"$f":"AG30*Simulator!$O$12^4+AH30*Simulator!$O$12^3+AI30*Simulator!$O$12^2+AJ30*Simulator!$O$12+AK30","v":{"$error":"#N/A"}},{"$f":"INDEX(MasterTable[],MATCH(Simulator!$E33,MasterTable[P/N],0),COLUMN(MasterTable[T^3]))","v":{"$error":"#N/A"}},{"$f":"INDEX(MasterTable[],MATCH(Simulator!$E33,MasterTable[P/N],0),COLUMN(MasterTable[T^2]))","v":{"$error":"#N/A"}},{"$f":"INDEX(MasterTable[],MATCH(Simulator!$E33,MasterTable[P/N],0),COLUMN(MasterTable[T]))","v":{"$error":"#N/A"}},{"$f":"INDEX(MasterTable[],MATCH(Simulator!$E33,MasterTable[P/N],0),COLUMN(MasterTable[T0]))","v":{"$error":"#N/A"}},{"$error":"#N/A"},{"$f":"AL30+AQ30-AF30","v":{"$error":"#N/A"}},null,{"$f":"INDEX(MasterTable[],MATCH(Simulator!$E33,MasterTable[P/N],0),COLUMN(MasterTable['# of Die]))","v":{"$error":"#N/A"}},{"$error":"#N/A"},{"$f":"INDEX(Tj_to_Vf6[],MATCH(Simulator!$I$8,Tj_to_Vf6[Vf],1),COLUMN(Tj_to_Vf6[Vf]))","v":-0.5},{"$error":"#N/A"},{"$f":"IF(AND(Simulator!$I$8=25,Simulator!$O$12=Simulator!M42),AF30,AR30)","v":{"$error":"#N/A"}}]
[null,"H15",{"$f":"IF(Simulator!$L$8=\"Case\",Simulator!$I$8,M31)","v":25},{"$f":"Simulator!$O$12*AR31/1000","v":{"$error":"#N/A"}},{"$f":"INDEX(MasterTable[],MATCH(Simulator!E34,MasterTable[P/N],0),COLUMN(MasterTable[Thermal Resistance]))","v":{"$error":"#N/A"}},{"$f":"C31+D31*E31","v":{"$error":"#N/A"}},null,{"$f":"IF(Simulator!$L$8=\"Case\",F31,Simulator!$I$8)","v":{"$error":"#N/A"}},{"$f":"Simulator!$O$12*AW31/1000","v":{"$error":"#N/A"}},{"$f":"E31","v":{"$error":"#N/A"}},{"$error":"#N/A"},null,{"$f":"IF(Simulator!$L$8=\"Case\",Simulator!$I$8,K31)","v":25},{"$f":"IF(Simulator!$L$8=\"Case\",H31,Simulator!$I$8)","v":{"$error":"#N/A"}},{"$f":"IF(#REF!=\"Tj\",N31,M31)","v":{"$error":"#REF!"}},null,{"$f":"INDEX(MasterTable[],MATCH(Simulator!E34,MasterTable[P/N],0),COLUMN(MasterTable[Typical Lumens]))","v":{"$error":"#N/A"}},{"$f":"INDEX(MasterTable[],MATCH(Simulator!$E34,MasterTable[P/N],0),COLUMN(MasterTable[I^3]))","v":{"$error":"#N/A"}},{"$f":"INDEX(MasterTable[],MATCH(Simulator!$E34,MasterTable[P/N],0),COLUMN(MasterTable[I^2]))","v":{"$error":"#N/A"}},{"$f":"INDEX(MasterTable[],MATCH(Simulator!$E34,MasterTable[P/N],0),COLUMN(MasterTable[I]))","v":{"$error":"#N/A"}},{"$f":"INDEX(MasterTable[],MATCH(Simulator!$E34,MasterTable[P/N],0),COLUMN(MasterTable[I0]))","v":{"$error":"#N/A"}},{"$f":"IF(Simulator!$O$12=Simulator!M34,1,S31*Simulator!$O$12^2+T31*Simulator!$O$12+U31)","v":{"$error":"#N/A"}},{"$f":"INDEX(MasterTable[],MATCH(Simulator!$E34,MasterTable[P/N],0),COLUMN(MasterTable[F^4]))","v":{"$error":"#N/A"}},{"$f":"INDEX(MasterTable[],MATCH(Simulator!$E34,MasterTable[P/N],0),COLUMN(MasterTable[F^3]))","v":{"$error":"#N/A"}},{"$f":"INDEX(MasterTable[],MATCH(Simulator!$E34,MasterTable[P/N],0),COLUMN(MasterTable[F^2]))","v":{"$error":"#N/A"}},{"$f":"INDEX(MasterTable[],MATCH(Simulator!$E34,MasterTable[P/N],0),COLUMN(MasterTable[F]))","v":{"$error":"#N/A"}},{"$f":"INDEX(MasterTable[],MATCH(Simulator!$E34,MasterTable[P/N],0),COLUMN(MasterTable[F0]))","v":{"$error":"#N/A"}},{"$f":"IF(Simulator!$I$8=85,Calculations!AE31,W31*M31^4+X31*M31^3+Y31*M31^2+Z31*M31+AA31)","v":{"$error":"#N/A"}},{"$error":"#N/A"},{"$f":"IF(AND(Simulator!$I$8=85,Simulator!$O$12=Simulator!M43),Q31*AE31,AC31)","v":{"$error":"#N/A"}},{"$f":"VLOOKUP(MID(Simulator!E34,6,3),Data!$P$61:$Q$65,2,FALSE)","v":{"$error":"#N/A"}},{"$f":"INDEX(MasterTable[],MATCH(Simulator!$E34,MasterTable[P/N],0),COLUMN(MasterTable[Typical Voltage]))","v":{"$error":"#N/A"}},{"$f":"INDEX(MasterTable[],MATCH(Simulator!$E34,MasterTable[P/N],0),COLUMN(MasterTable[V^4]))","v":{"$error":"#N/A"}},{"$f":"INDEX(MasterTable[],MATCH(Simulator!$E34,MasterTable[P/N],0),COLUMN(MasterTable[V^3]))","v":{"$error":"#N/A"}},{"$f":"INDEX(MasterTable[],MATCH(Simulator!$E34,MasterTable[P/N],0),COLUMN(MasterTable[V^2]))","v":{"$error":"#N/A"}},{"$f":"INDEX(MasterTable[],MATCH(Simulator!$E34,MasterTable[P/N],0),COLUMN(MasterTable[V]))","v":{"$error":"#N/A"}},{"$f":"INDEX(MasterTable[],MATCH(Simulator!$E34,MasterTable[P/N],0),COLUMN(MasterTable[V0]))","v":{"$error":"#N/A"}},{"$f":"AG31*Simulator!$O$12^4+AH31*Simulator!$O$12^3+AI31*Simulator!$O$12^2+AJ31*Simulator!$O$12+AK31","v":{"$error":"#N/A"}},{"$f":"INDEX(MasterTable[],MATCH(Simulator!$E34,MasterTable[P/N],0),COLUMN(MasterTable[T^3]))","v":{"$error":"#N/A"}},{"$f":"INDEX(MasterTable[],MATCH(Simulator!$E34,MasterTable[P/N],0),COLUMN(MasterTable[T^2]))","v":{"$error":"#N/A"}},{"$f":"INDEX(MasterTable[],MATCH(Simulator!$E34,MasterTable[P/N],0),COLUMN(MasterTable[T]))","v":{"$error":"#N/A"}},{"$f":"INDEX(MasterTable[],MATCH(Simulator!$E34,MasterTable[P/N],0),COLUMN(MasterTable[T0]))","v":{"$error":"#N/A"}},{"$error":"#N/A"},{"$error":"#N/A"},null,{"$f":"INDEX(MasterTable[],MATCH(Simulator!$E34,MasterTable[P/N],0),COLUMN(MasterTable['# of Die]))","v":{"$error":"#N/A"}},{"$error":"#N/A"},{"$f":"INDEX(Tj_to_Vf6[],MATCH(Simulator!$I$8,Tj_to_Vf6[Vf],1),COLUMN(Tj_to_Vf6[Vf]))","v":-0.5},{"$error":"#N/A"},{"$f":"IF(AND(Simulator!$I$8=25,Simulator!$O$12=Simulator!M43),AF31,AR31)","v":{"$error":"#N/A"}}]
[null,null,null,null,null,null,null,null,null,null,null,null,null,null,null,null,null,null,null,null,null,null,null,null,null,{"$f":"INDEX(MasterTable[],MATCH(Simulator!$E35,MasterTable[P/N],0),COLUMN(MasterTable[F]))","v":{"$error":"#N/A"}}]
["Calculations using Lumen Input",null,"Converting Tc to Tj",null,null,null,null,"Converting Tj to Tc",null,null,null,null,null,null,null,null,"Calculating Current",null,null,null,null,null,null,null,null,null,null,null,null,null,null,"Calculating Voltage w/ Tc",null,null,null,null,null,null,null,null,null,null,null,null,null,null,"Calculating Voltage w/ Tj"]
[null,null,"Tj = Tc + Power*Thermal Resistance",null,null,null,null,"Tc = Tj - Power*Thermal Resistance",null,null,null,null,null,null,null,null,"I=Fr@I*Eqn; Fr@I=Fro/Fr@T",null,null,null,null,null,null,null,null,null,null,null,null,null,null,"Vf@Tc&I = Vf@I + Vf@Tc-Vft",null,null,null,null,null,null,null,null,null,null,null,null,null,null,"Vf@Tj&I = Vf@I + Vf@Tj Modifier"]
[null,null,"Tc","Power","Thermal Resistance","Tc>>Tj",null,"Tj","Power","Thermal Resistance","Tj>>Tc",null,"Tc","Tj",{"$f":"IF(Simulator!$L$8=\"Case\",\"Tj\",\"Tc\")","v":"Tj"},null,"Ft","Fr@I Eqn",null,null,null,"Req'd I",null,"Fr@Tc Eqn",null,null,null,"Fr@Tc","Fro",null,"Fr@I","Vft",null,"Vf@I Eqn",null,null,null,"Vf@I","Vf@Tc Eqn",null,null,null,"Vf@Tc","Vf@Tc&I",null,"# of Die","Vf@I","Vf@Tj Modifier, per Die","Vf@Tj&I","Voltage Report"]
[null,"V6",{"$f":"IF(Simulator!$L$8=\"Case\",Simulator!$I$8,M36)","v":25},{"$f":"Simulator!G42*AR36/1000","v":{"$error":"#VALUE!"}},{"$f":"INDEX(MasterTable[],MATCH(Simulator!E42,MasterTable[P/N],0),COLUMN(MasterTable[Thermal Resistance]))","v":{"$error":"#N/A"}},{"$f":"C36+D36*E36","v":{"$error":"#VALUE!"}},null,{"$f":"IF(Simulator!$L$8=\"Case\",F36,Simulator!$I$8)","v":{"$error":"#VALUE!"}},{"$f":"Simulator!G42*AW36/1000","v":{"$error":"#VALUE!"}},{"$f":"E36","v":{"$error":"#N/A"}},{"$f":"H36-I36*J36","v":{"$error":"#VALUE!"}},null,{"$f":"IF(Simulator!$L$8=\"Case\",Simulator!$I$8,K36)","v":25},{"$f":"IF(Simulator!$L$8=\"Case\",H36,Simulator!$I$8)","v":{"$error":"#VALUE!"}},{"$f":"IF(#REF!=\"Tj\",N36,M36)","v":{"$error":"#REF!"}},null,{"$f":"INDEX(MasterTable[],MATCH(Simulator!E42,MasterTable[P/N],0),COLUMN(MasterTable[Typical Lumens]))","v":{"$error":"#N/A"}},{"$f":"INDEX(MasterTable[],MATCH(Simulator!$E42,MasterTable[P/N],0),COLUMN(MasterTable[I^3]))","v":{"$error":"#N/A"}},{"$f":"INDEX(MasterTable[],MATCH(Simulator!$E42,MasterTable[P/N],0),COLUMN(MasterTable[I^2]))","v":{"$error":"#N/A"}},{"$f":"INDEX(MasterTable[],MATCH(Simulator!$E42,MasterTable[P/N],0),COLUMN(MasterTable[I]))","v":{"$error":"#N/A"}},{"$f":"INDEX(MasterTable[],MATCH(Simulator!$E42,MasterTable[P/N],0),COLUMN(MasterTable[I0]))","v":{"$error":"#N/A"}},{"$f":"(-T36+SQRT(T36^2-4*S36*(U36-AE36)))/(2*S36)","v":{"$error":"#N/A"}},{"$f":"INDEX(MasterTable[],MATCH(Simulator!$E42,MasterTable[P/N],0),COLUMN(MasterTable[F^4]))","v":{"$error":"#N/A"}},{"$f":"INDEX(MasterTable[],MATCH(Simulator!$E42,MasterTable[P/N],0),COLUMN(MasterTable[F^3]))","v":{"$error":"#N/A"}},{"$f":"INDEX(MasterTable[],MATCH(Simulator!$E42,MasterTable[P/N],0),COLUMN(MasterTable[F^2]))","v":{"$error":"#N/A"}},{"$f":"INDEX(MasterTable[],MATCH(Simulator!$E42,MasterTable[P/N],0),COLUMN(MasterTable[F]))","v":{"$error":"#N/A"}},{"$f":"INDEX(MasterTable[],MATCH(Simulator!$E42,MasterTable[P/N],0),COLUMN(MasterTable[F0]))","v":{"$error":"#N/A"}},{"$f":"IF(Simulator!$I$8=85,Calculations!AE6,W36*M36^4+X36*M36^3+Y36*M36^2+Z36*M36+AA36)","v":{"$error":"#N/A"}},{"$f":"Simulator!$O$38/Q36","v":{"$error":"#N/A"}},null,{"$f":"AC36/AB36","v":{"$error":"#N/A"}},{"$f":"INDEX(MasterTable[],MATCH(Simulator!$E42,MasterTable[P/N],0),COLUMN(MasterTable[Typical Voltage]))","v":{"$error":"#N/A"}},{"$f":"INDEX(MasterTable[],MATCH(Simulator!$E42,MasterTable[P/N],0),COLUMN(MasterTable[V^4]))","v":{"$error":"#N/A"}},{"$f":"INDEX(MasterTable[],MATCH(Simulator!$E42,MasterTable[P/N],0),COLUMN(MasterTable[V^3]))","v":{"$error":"#N/A"}},{"$f":"INDEX(MasterTable[],MATCH(Simulator!$E42,MasterTable[P/N],0),COLUMN(MasterTable[V^2]))","v":{"$error":"#N/A"}},{"$f":"INDEX(MasterTable[],MATCH(Simulator!$E42,MasterTable[P/N],0),COLUMN(MasterTable[V]))","v":{"$error":"#N/A"}},{"$f":"INDEX(MasterTable[],MATCH(Simulator!$E42,MasterTable[P/N],0),COLUMN(MasterTable[V0]))","v":{"$error":"#N/A"}},{"$f":"AG36*V36^4+AH36*V36^3+AI36*V36^2+AJ36*V36+AK36","v":{"$error":"#N/A"}},{"$f":"INDEX(MasterTable[],MATCH(Simulator!$E42,MasterTable[P/N],0),COLUMN(MasterTable[T^3]))","v":{"$error":"#N/A"}},{"$f":"INDEX(MasterTable[],MATCH(Simulator!$E42,MasterTable[P/N],0),COLUMN(MasterTable[T^2]))","v":{"$error":"#N/A"}},{"$f":"INDEX(MasterTable[],MATCH(Simulator!$E42,MasterTable[P/N],0),COLUMN(MasterTable[T]))","v":{"$error":"#N/A"}},{"$f":"INDEX(MasterTable[],MATCH(Simulator!$E42,MasterTable[P/N],0),COLUMN(MasterTable[T0]))","v":{"$error":"#N/A"}},{"$f":"AM36*M36^3+AN36*M36^2+AO36*M36+AP36","v":{"$error":"#N/A"}},{"$f":"AL36+AQ36-AF36","v":{"$error":"#N/A"}},null,{"$f":"INDEX(MasterTable[],MATCH(Simulator!$E42,MasterTable[P/N],0),COLUMN(MasterTable['# of Die]))","v":{"$error":"#N/A"}},{"$f":"AL36","v":{"$error":"#N/A"}},{"$f":"INDEX(Tj_to_Vf6[],MATCH(Simulator!$I$8,Tj_to_Vf6[Vf],1),COLUMN(Tj_to_Vf6[Vf]))","v":-0.5},{"$f":"AU36+AV36*AT36","v":{"$error":"#N/A"}},{"$f":"IF(Simulator!$I$8=25,AQ36,AR36)","v":{"$error":"#N/A"}}]
[null,"V6",{"$f":"IF(Simulator!$L$8=\"Case\",Simulator!$I$8,M37)","v":25},{"$f":"Simulator!G43*AR37/1000","v":{"$error":"#VALUE!"}},{"$f":"INDEX(MasterTable[],MATCH(Simulator!E43,MasterTable[P/N],0),COLUMN(MasterTable[Thermal Resistance]))","v":{"$error":"#N/A"}},{"$f":"C37+D37*E37","v":{"$error":"#VALUE!"}},null,{"$f":"IF(Simulator!$L$8=\"Case\",F37,Simulator!$I$8)","v":{"$error":"#VALUE!"}},{"$f":"Simulator!G43*AW37/1000","v":{"$error":"#VALUE!"}},{"$f":"E37","v":{"$error":"#N/A"}},{"$f":"H37-I37*J37","v":{"$error":"#VALUE!"}},null,{"$f":"IF(Simulator!$L$8=\"Case\",Simulator!$I$8,K37)","v":25},{"$f":"IF(Simulator!$L$8=\"Case\",H37,Simulator!$I$8)","v":{"$error":"#VALUE!"}},{"$f":"IF(#REF!=\"Tj\",N37,M37)","v":{"$error":"#REF!"}},null,{"$f":"INDEX(MasterTable[],MATCH(Simulator!E43,MasterTable[P/N],0),COLUMN(MasterTable[Typical Lumens]))","v":{"$error":"#N/A"}},{"$f":"INDEX(MasterTable[],MATCH(Simulator!$E43,MasterTable[P/N],0),COLUMN(MasterTable[I^3]))","v":{"$error":"#N/A"}},{"$f":"INDEX(MasterTable[],MATCH(Simulator!$E43,MasterTable[P/N],0),COLUMN(MasterTable[I^2]))","v":{"$error":"#N/A"}},{"$f":"INDEX(MasterTable[],MATCH(Simulator!$E43,MasterTable[P/N],0),COLUMN(MasterTable[I]))","v":{"$error":"#N/A"}},{"$f":"INDEX(MasterTable[],MATCH(Simulator!$E43,MasterTable[P/N],0),COLUMN(MasterTable[I0]))","v":{"$error":"#N/A"}},{"$f":"(-T37+SQRT(T37^2-4*S37*(U37-AE37)))/(2*S37)","v":{"$error":"#N/A"}},{"$f":"INDEX(MasterTable[],MATCH(Simulator!$E43,MasterTable[P/N],0),COLUMN(MasterTable[F^4]))","v":{"$error":"#N/A"}},{"$f":"INDEX(MasterTable[],MATCH(Simulator!$E43,MasterTable[P/N],0),COLUMN(MasterTable[F^3]))","v":{"$error":"#N/A"}},{"$f":"INDEX(MasterTable[],MATCH(Simulator!$E43,MasterTable[P/N],0),COLUMN(MasterTable[F^2]))","v":{"$error":"#N/A"}},{"$f":"INDEX(MasterTable[],MATCH(Simulator!$E43,MasterTable[P/N],0),COLUMN(MasterTable[F]))","v":{"$error":"#N/A"}},{"$f":"INDEX(MasterTable[],MATCH(Simulator!$E43,MasterTable[P/N],0),COLUMN(MasterTable[F0]))","v":{"$error":"#N/A"}},{"$f":"IF(Simulator!$I$8=85,Calculations!AE7,W37*M37^4+X37*M37^3+Y37*M37^2+Z37*M37+AA37)","v":{"$error":"#N/A"}},{"$f":"Simulator!$O$38/Q37","v":{"$error":"#N/A"}},null,{"$f":"AC37/AB37","v":{"$error":"#N/A"}},{"$f":"INDEX(MasterTable[],MATCH(Simulator!$E43,MasterTable[P/N],0),COLUMN(MasterTable[Typical Voltage]))","v":{"$error":"#N/A"}},{"$f":"INDEX(MasterTable[],MATCH(Simulator!$E43,MasterTable[P/N],0),COLUMN(MasterTable[V^4]))","v":{"$error":"#N/A"}},{"$f":"INDEX(MasterTable[],MATCH(Simulator!$E43,MasterTable[P/N],0),COLUMN(MasterTable[V^3]))","v":{"$error":"#N/A"}},{"$f":"INDEX(MasterTable[],MATCH(Simulator!$E43,MasterTable[P/N],0),COLUMN(MasterTable[V^2]))","v":{"$error":"#N/A"}},{"$f":"INDEX(MasterTable[],MATCH(Simulator!$E43,MasterTable[P/N],0),COLUMN(MasterTable[V]))","v":{"$error":"#N/A"}},{"$f":"INDEX(MasterTable[],MATCH(Simulator!$E43,MasterTable[P/N],0),COLUMN(MasterTable[V0]))","v":{"$error":"#N/A"}},{"$f":"AG37*V37^4+AH37*V37^3+AI37*V37^2+AJ37*V37+AK37","v":{"$error":"#N/A"}},{"$f":"INDEX(MasterTable[],MATCH(Simulator!$E43,MasterTable[P/N],0),COLUMN(MasterTable[T^3]))","v":{"$error":"#N/A"}},{"$f":"INDEX(MasterTable[],MATCH(Simulator!$E43,MasterTable[P/N],0),COLUMN(MasterTable[T^2]))","v":{"$error":"#N/A"}},{"$f":"INDEX(MasterTable[],MATCH(Simulator!$E43,MasterTable[P/N],0),COLUMN(MasterTable[T]))","v":{"$error":"#N/A"}},{"$f":"INDEX(MasterTable[],MATCH(Simulator!$E43,MasterTable[P/N],0),COLUMN(MasterTable[T0]))","v":{"$error":"#N/A"}},{"$f":"AM37*M37^3+AN37*M37^2+AO37*M37+AP37","v":{"$error":"#N/A"}},{"$f":"AL37+AQ37-AF37","v":{"$error":"#N/A"}},null,{"$f":"INDEX(MasterTable[],MATCH(Simulator!$E43,MasterTable[P/N],0),COLUMN(MasterTable['# of Die]))","v":{"$error":"#N/A"}},{"$f":"AL37","v":{"$error":"#N/A"}},{"$f":"INDEX(Tj_to_Vf6[],MATCH(Simulator!$I$8,Tj_to_Vf6[Vf],1),COLUMN(Tj_to_Vf6[Vf]))","v":-0.5},{"$f":"AU37+AV37*AT37","v":{"$error":"#N/A"}},{"$f":"IF(Simulator!$I$8=25,AQ37,AR37)","v":{"$error":"#N/A"}}]
[null,"V8",{"$f":"IF(Simulator!$L$8=\"Case\",Simulator!$I$8,M38)","v":25},{"$f":"Simulator!G44*AR38/1000","v":{"$error":"#VALUE!"}},{"$f":"INDEX(MasterTable[],MATCH(Simulator!E44,MasterTable[P/N],0),COLUMN(MasterTable[Thermal Resistance]))","v":{"$error":"#N/A"}},{"$f":"C38+D38*E38","v":{"$error":"#VALUE!"}},null,{"$f":"IF(Simulator!$L$8=\"Case\",F38,Simulator!$I$8)","v":{"$error":"#VALUE!"}},{"$f":"Simulator!G44*AW38/1000","v":{"$error":"#VALUE!"}},{"$f":"E38","v":{"$error":"#N/A"}},{"$f":"H38-I38*J38","v":{"$error":"#VALUE!"}},null,{"$f":"IF(Simulator!$L$8=\"Case\",Simulator!$I$8,K38)","v":25},{"$f":"IF(Simulator!$L$8=\"Case\",H38,Simulator!$I$8)","v":{"$error":"#VALUE!"}},{"$f":"IF(#REF!=\"Tj\",N38,M38)","v":{"$error":"#REF!"}},null,{"$f":"INDEX(MasterTable[],MATCH(Simulator!E44,MasterTable[P/N],0),COLUMN(MasterTable[Typical Lumens]))","v":{"$error":"#N/A"}},{"$f":"INDEX(MasterTable[],MATCH(Simulator!$E44,MasterTable[P/N],0),COLUMN(MasterTable[I^3]))","v":{"$error":"#N/A"}},{"$f":"INDEX(MasterTable[],MATCH(Simulator!$E44,MasterTable[P/N],0),COLUMN(MasterTable[I^2]))","v":{"$error":"#N/A"}},{"$f":"INDEX(MasterTable[],MATCH(Simulator!$E44,MasterTable[P/N],0),COLUMN(MasterTable[I]))","v":{"$error":"#N/A"}},{"$f":"INDEX(MasterTable[],MATCH(Simulator!$E44,MasterTable[P/N],0),COLUMN(MasterTable[I0]))","v":{"$error":"#N/A"}},{"$f":"(-T38+SQRT(T38^2-4*S38*(U38-AE38)))/(2*S38)","v":{"$error":"#N/A"}},{"$f":"INDEX(MasterTable[],MATCH(Simulator!$E44,MasterTable[P/N],0),COLUMN(MasterTable[F^4]))","v":{"$error":"#N/A"}},{"$f":"INDEX(MasterTable[],MATCH(Simulator!$E44,MasterTable[P/N],0),COLUMN(MasterTable[F^3]))","v":{"$error":"#N/A"}},{"$f":"INDEX(MasterTable[],MATCH(Simulator!$E44,MasterTable[P/N],0),COLUMN(MasterTable[F^2]))","v":{"$error":"#N/A"}},{"$f":"INDEX(MasterTable[],MATCH(Simulator!$E44,MasterTable[P/N],0),COLUMN(MasterTable[F]))","v":{"$error":"#N/A"}},{"$f":"INDEX(MasterTable[],MATCH(Simulator!$E44,MasterTable[P/N],0),COLUMN(MasterTable[F0]))","v":{"$error":"#N/A"}},{"$f":"IF(Simulator!$I$8=85,Calculations!AE8,W38*M38^4+X38*M38^3+Y38*M38^2+Z38*M38+AA38)","v":{"$error":"#N/A"}},{"$f":"Simulator!$O$38/Q38","v":{"$error":"#N/A"}},null,{"$f":"AC38/AB38","v":{"$error":"#N/A"}},{"$f":"INDEX(MasterTable[],MATCH(Simulator!$E44,MasterTable[P/N],0),COLUMN(MasterTable[Typical Voltage]))","v":{"$error":"#N/A"}},{"$f":"INDEX(MasterTable[],MATCH(Simulator!$E44,MasterTable[P/N],0),COLUMN(MasterTable[V^4]))","v":{"$error":"#N/A"}},{"$f":"INDEX(MasterTable[],MATCH(Simulator!$E44,MasterTable[P/N],0),COLUMN(MasterTable[V^3]))","v":{"$error":"#N/A"}},{"$f":"INDEX(MasterTable[],MATCH(Simulator!$E44,MasterTable[P/N],0),COLUMN(MasterTable[V^2]))","v":{"$error":"#N/A"}},{"$f":"INDEX(MasterTable[],MATCH(Simulator!$E44,MasterTable[P/N],0),COLUMN(MasterTable[V]))","v":{"$error":"#N/A"}},{"$f":"INDEX(MasterTable[],MATCH(Simulator!$E44,MasterTable[P/N],0),COLUMN(MasterTable[V0]))","v":{"$error":"#N/A"}},{"$error":"#N/A"},{"$f":"INDEX(MasterTable[],MATCH(Simulator!$E44,MasterTable[P/N],0),COLUMN(MasterTable[T^3]))","v":{"$error":"#N/A"}},{"$f":"INDEX(MasterTable[],MATCH(Simulator!$E44,MasterTable[P/N],0),COLUMN(MasterTable[T^2]))","v":{"$error":"#N/A"}},{"$f":"INDEX(MasterTable[],MATCH(Simulator!$E44,MasterTable[P/N],0),COLUMN(MasterTable[T]))","v":{"$error":"#N/A"}},{"$f":"INDEX(MasterTable[],MATCH(Simulator!$E44,MasterTable[P/N],0),COLUMN(MasterTable[T0]))","v":{"$error":"#N/A"}},{"$error":"#N/A"},{"$error":"#N/A"},null,{"$f":"INDEX(MasterTable[],MATCH(Simulator!$E44,MasterTable[P/N],0),COLUMN(MasterTable['# of Die]))","v":{"$error":"#N/A"}},{"$f":"AL38","v":{"$error":"#N/A"}},{"$f":"INDEX(Tj_to_Vf6[],MATCH(Simulator!$I$8,Tj_to_Vf6[Vf],1),COLUMN(Tj_to_Vf6[Vf]))","v":-0.5},{"$f":"AU38+AV38*AT38","v":{"$error":"#N/A"}},{"$f":"IF(Simulator!$I$8=25,AQ38,AR38)","v":{"$error":"#N/A"}}]
[null,"V8",{"$f":"IF(Simulator!$L$8=\"Case\",Simulator!$I$8,M39)","v":25},{"$f":"Simulator!G45*AR39/1000","v":0.31005650672483348},{"$f":"INDEX(MasterTable[],MATCH(Simulator!E45,MasterTable[P/N],0),COLUMN(MasterTable[Thermal Resistance]))","v":0.71},{"$f":"C39+D39*E39","v":25.220140119774634},null,{"$f":"IF(Simulator!$L$8=\"Case\",F39,Simulator!$I$8)","v":25.220140119774634},{"$f":"Simulator!G45*AW39/1000","v":0.25005650672483343},{"$f":"E39","v":0.71},{"$f":"H39-I39*J39","v":25.0426},null,{"$f":"IF(Simulator!$L$8=\"Case\",Simulator!$I$8,K39)","v":25},{"$f":"IF(Simulator!$L$8=\"Case\",H39,Simulator!$I$8)","v":25.220140119774634},{"$f":"IF(#REF!=\"Tj\",N39,M39)","v":{"$error":"#REF!"}},null,{"$f":"INDEX(MasterTable[],MATCH(Simulator!E45,MasterTable[P/N],0),COLUMN(MasterTable[Typical Lumens]))","v":716},{"$f":"INDEX(MasterTable[],MATCH(Simulator!$E45,MasterTable[P/N],0),COLUMN(MasterTable[I^3]))","v":0},{"$f":"INDEX(MasterTable[],MATCH(Simulator!$E45,MasterTable[P/N],0),COLUMN(MasterTable[I^2]))","v":-4.1047244976000001E-6},{"$f":"INDEX(MasterTable[],MATCH(Simulator!$E45,MasterTable[P/N],0),COLUMN(MasterTable[I]))","v":6.3759312470999998E-3},{"$f":"INDEX(MasterTable[],MATCH(Simulator!$E45,MasterTable[P/N],0),COLUMN(MasterTable[I0]))","v":7.2647760056000002E-3},{"$f":"(-T39+SQRT(T39^2-4*S39*(U39-AE39)))/(2*S39)","v":7.6724170325589638},{"$f":"INDEX(MasterTable[],MATCH(Simulator!$E45,MasterTable[P/N],0),COLUMN(MasterTable[F^4]))","v":0},{"$f":"INDEX(MasterTable[],MATCH(Simulator!$E45,MasterTable[P/N],0),COLUMN(MasterTable[F^3]))","v":0},{"$f":"INDEX(MasterTable[],MATCH(Simulator!$E45,MasterTable[P/N],0),COLUMN(MasterTable[F^2]))","v":-6.6243244394999998E-6},{"$f":"INDEX(MasterTable[],MATCH(Simulator!$E45,MasterTable[P/N],0),COLUMN(MasterTable[F]))","v":-1.1278369862E-3},{"$f":"INDEX(MasterTable[],MATCH(Simulator!$E45,MasterTable[P/N],0),COLUMN(MasterTable[F0]))","v":1.0309770566000001},{"$f":"IF(Simulator!$I$8=85,Calculations!AE9,W39*M39^4+X39*M39^3+Y39*M39^2+Z39*M39+AA39)","v":0.99864092917031255},{"$f":"Simulator!$O$38/Q39","v":5.5865921787709494E-2},null,{"$f":"AC39/AB39","v":5.594195086128087E-2},{"$f":"INDEX(MasterTable[],MATCH(Simulator!$E45,MasterTable[P/N],0),COLUMN(MasterTable[Typical Voltage]))","v":35.6},{"$f":"INDEX(MasterTable[],MATCH(Simulator!$E45,MasterTable[P/N],0),COLUMN(MasterTable[V^4]))","v":-1.0000000000000001E-9},{"$f":"INDEX(MasterTable[],MATCH(Simulator!$E45,MasterTable[P/N],0),COLUMN(MasterTable[V^3]))","v":8.6600000000000005E-7},{"$f":"INDEX(MasterTable[],MATCH(Simulator!$E45,MasterTable[P/N],0),COLUMN(MasterTable[V^2]))","v":-2.7099999999999997E-4},{"$f":"INDEX(MasterTable[],MATCH(Simulator!$E45,MasterTable[P/N],0),COLUMN(MasterTable[V]))","v":5.4899999999999997E-2},{"$f":"INDEX(MasterTable[],MATCH(Simulator!$E45,MasterTable[P/N],0),COLUMN(MasterTable[V0]))","v":30.6},31.005650672483345,{"$f":"INDEX(MasterTable[],MATCH(Simulator!$E45,MasterTable[P/N],0),COLUMN(MasterTable[T^3]))","v":0},{"$f":"INDEX(MasterTable[],MATCH(Simulator!$E45,MasterTable[P/N],0),COLUMN(MasterTable[T^2]))","v":0},{"$f":"INDEX(MasterTable[],MATCH(Simulator!$E45,MasterTable[P/N],0),COLUMN(MasterTable[T]))","v":-1.7000000000000001E-2},{"$f":"INDEX(MasterTable[],MATCH(Simulator!$E45,MasterTable[P/N],0),COLUMN(MasterTable[T0]))","v":36.024999999999999},35.6,31.005650672483348,null,{"$f":"INDEX(MasterTable[],MATCH(Simulator!$E45,MasterTable[P/N],0),COLUMN(MasterTable['# of Die]))","v":12},{"$f":"AL39","v":31.005650672483345},{"$f":"INDEX(Tj_to_Vf6[],MATCH(Simulator!$I$8,Tj_to_Vf6[Vf],1),COLUMN(Tj_to_Vf6[Vf]))","v":-0.5},{"$f":"AU39+AV39*AT39","v":25.005650672483345},{"$f":"IF(Simulator!$I$8=25,AQ39,AR39)","v":35.6}]
[null,"V8",{"$f":"IF(Simulator!$L$8=\"Case\",Simulator!$I$8,M40)","v":25},{"$f":"Simulator!G46*AR40/1000","v":0.23299345183248088},{"$f":"INDEX(MasterTable[],MATCH(Simulator!E46,MasterTable[P/N],0),COLUMN(MasterTable[Thermal Resistance]))","v":0.71},{"$f":"C40+D40*E40","v":25.165425350801062},null,{"$f":"IF(Simulator!$L$8=\"Case\",F40,Simulator!$I$8)","v":25.165425350801062},{"$f":"Simulator!G46*AW40/1000","v":0.14299345183248083},{"$f":"E40","v":0.71},{"$f":"H40-I40*J40","v":25.0639},null,{"$f":"IF(Simulator!$L$8=\"Case\",Simulator!$I$8,K40)","v":25},{"$f":"IF(Simulator!$L$8=\"Case\",H40,Simulator!$I$8)","v":25.165425350801062},{"$f":"IF(#REF!=\"Tj\",N40,M40)","v":{"$error":"#REF!"}},null,{"$f":"INDEX(MasterTable[],MATCH(Simulator!E46,MasterTable[P/N],0),COLUMN(MasterTable[Typical Lumens]))","v":716},{"$f":"INDEX(MasterTable[],MATCH(Simulator!$E46,MasterTable[P/N],0),COLUMN(MasterTable[I^3]))","v":0},{"$f":"INDEX(MasterTable[],MATCH(Simulator!$E46,MasterTable[P/N],0),COLUMN(MasterTable[I^2]))","v":-1.0261811244E-6},{"$f":"INDEX(MasterTable[],MATCH(Simulator!$E46,MasterTable[P/N],0),COLUMN(MasterTable[I]))","v":3.1879656235999998E-3},{"$f":"INDEX(MasterTable[],MATCH(Simulator!$E46,MasterTable[P/N],0),COLUMN(MasterTable[I0]))","v":7.2647760056000002E-3},{"$f":"(-T40+SQRT(T40^2-4*S40*(U40-AE40)))/(2*S40)","v":15.344834064874712},{"$f":"INDEX(MasterTable[],MATCH(Simulator!$E46,MasterTable[P/N],0),COLUMN(MasterTable[F^4]))","v":0},{"$f":"INDEX(MasterTable[],MATCH(Simulator!$E46,MasterTable[P/N],0),COLUMN(MasterTable[F^3]))","v":0},{"$f":"INDEX(MasterTable[],MATCH(Simulator!$E46,MasterTable[P/N],0),COLUMN(MasterTable[F^2]))","v":-6.6243244394999998E-6},{"$f":"INDEX(MasterTable[],MATCH(Simulator!$E46,MasterTable[P/N],0),COLUMN(MasterTable[F]))","v":-1.1278369862E-3},{"$f":"INDEX(MasterTable[],MATCH(Simulator!$E46,MasterTable[P/N],0),COLUMN(MasterTable[F0]))","v":1.0309770566000001},{"$f":"IF(Simulator!$I$8=85,Calculations!AE10,W40*M40^4+X40*M40^3+Y40*M40^2+Z40*M40+AA40)","v":0.99864092917031255},{"$f":"Simulator!$O$38/Q40","v":5.5865921787709494E-2},null,{"$f":"AC40/AB40","v":5.594195086128087E-2},{"$f":"INDEX(MasterTable[],MATCH(Simulator!$E46,MasterTable[P/N],0),COLUMN(MasterTable[Typical Voltage]))","v":17.8},{"$f":"INDEX(MasterTable[],MATCH(Simulator!$E46,MasterTable[P/N],0),COLUMN(MasterTable[V^4]))","v":-7.4382650239000006E-11},{"$f":"INDEX(MasterTable[],MATCH(Simulator!$E46,MasterTable[P/N],0),COLUMN(MasterTable[V^3]))","v":9.4360629142000003E-8},{"$f":"INDEX(MasterTable[],MATCH(Simulator!$E46,MasterTable[P/N],0),COLUMN(MasterTable[V^2]))","v":-4.4394203422999998E-5},{"$f":"INDEX(MasterTable[],MATCH(Simulator!$E46,MasterTable[P/N],0),COLUMN(MasterTable[V]))","v":1.4251995236000001E-2},{"$f":"INDEX(MasterTable[],MATCH(Simulator!$E46,MasterTable[P/N],0),COLUMN(MasterTable[V0]))","v":15.324318705},15.532896788832055,{"$f":"INDEX(MasterTable[],MATCH(Simulator!$E46,MasterTable[P/N],0),COLUMN(MasterTable[T^3]))","v":0},{"$f":"INDEX(MasterTable[],MATCH(Simulator!$E46,MasterTable[P/N],0),COLUMN(MasterTable[T^2]))","v":0},{"$f":"INDEX(MasterTable[],MATCH(Simulator!$E46,MasterTable[P/N],0),COLUMN(MasterTable[T]))","v":-7.0000000000000001E-3},{"$f":"INDEX(MasterTable[],MATCH(Simulator!$E46,MasterTable[P/N],0),COLUMN(MasterTable[T0]))","v":17.975000000000001},17.8,15.532896788832058,null,{"$f":"INDEX(MasterTable[],MATCH(Simulator!$E46,MasterTable[P/N],0),COLUMN(MasterTable['# of Die]))","v":12},{"$f":"AL40","v":15.532896788832055},{"$f":"INDEX(Tj_to_Vf6[],MATCH(Simulator!$I$8,Tj_to_Vf6[Vf],1),COLUMN(Tj_to_Vf6[Vf]))","v":-0.5},{"$f":"AU40+AV40*AT40","v":9.5328967888320548},{"$f":"IF(Simulator!$I$8=25,AQ40,AR40)","v":17.8}]
[null,"V10",{"$f":"IF(Simulator!$L$8=\"Case\",Simulator!$I$8,M41)","v":25},{"$f":"Simulator!G47*AR41/1000","v":0.22905683592298332},{"$f":"INDEX(MasterTable[],MATCH(Simulator!E47,MasterTable[P/N],0),COLUMN(MasterTable[Thermal Resistance]))","v":0.47},25.107656712883802,null,{"$f":"IF(Simulator!$L$8=\"Case\",F41,Simulator!$I$8)","v":25.107656712883802},{"$f":"Simulator!G47*AW41/1000","v":0.13905683592298329},0.47,25.042300000000001,null,{"$f":"IF(Simulator!$L$8=\"Case\",Simulator!$I$8,K41)","v":25},{"$f":"IF(Simulator!$L$8=\"Case\",H41,Simulator!$I$8)","v":25.107656712883802},{"$f":"IF(#REF!=\"Tj\",N41,M41)","v":{"$error":"#REF!"}},null,{"$f":"INDEX(MasterTable[],MATCH(Simulator!E47,MasterTable[P/N],0),COLUMN(MasterTable[Typical Lumens]))","v":1076},{"$f":"INDEX(MasterTable[],MATCH(Simulator!$E47,MasterTable[P/N],0),COLUMN(MasterTable[I^3]))","v":0},{"$f":"INDEX(MasterTable[],MATCH(Simulator!$E47,MasterTable[P/N],0),COLUMN(MasterTable[I^2]))","v":-8.2389999999999996E-7},{"$f":"INDEX(MasterTable[],MATCH(Simulator!$E47,MasterTable[P/N],0),COLUMN(MasterTable[I]))","v":3.1546209999999998E-3},{"$f":"INDEX(MasterTable[],MATCH(Simulator!$E47,MasterTable[P/N],0),COLUMN(MasterTable[I0]))","v":0},11.826803759167239,{"$f":"INDEX(MasterTable[],MATCH(Simulator!$E47,MasterTable[P/N],0),COLUMN(MasterTable[F^4]))","v":0},{"$f":"INDEX(MasterTable[],MATCH(Simulator!$E47,MasterTable[P/N],0),COLUMN(MasterTable[F^3]))","v":0},{"$f":"INDEX(MasterTable[],MATCH(Simulator!$E47,MasterTable[P/N],0),COLUMN(MasterTable[F^2]))","v":-4.8574999999999997E-6},{"$f":"INDEX(MasterTable[],MATCH(Simulator!$E47,MasterTable[P/N],0),COLUMN(MasterTable[F]))","v":-1.1899886999999999E-3},{"$f":"INDEX(MasterTable[],MATCH(Simulator!$E47,MasterTable[P/N],0),COLUMN(MasterTable[F0]))","v":1.0322715723},{"$f":"IF(Simulator!$I$8=85,Calculations!AE11,W41*M41^4+X41*M41^3+Y41*M41^2+Z41*M41+AA41)","v":0.99948591730000003},{"$f":"Simulator!$O$38/Q41","v":3.717472118959108E-2},null,3.719384190025854E-2,{"$f":"INDEX(MasterTable[],MATCH(Simulator!$E47,MasterTable[P/N],0),COLUMN(MasterTable[Typical Voltage]))","v":26.5},{"$f":"INDEX(MasterTable[],MATCH(Simulator!$E47,MasterTable[P/N],0),COLUMN(MasterTable[V^4]))","v":-3.2099999999999998E-11},{"$f":"INDEX(MasterTable[],MATCH(Simulator!$E47,MasterTable[P/N],0),COLUMN(MasterTable[V^3]))","v":5.4800000000000001E-8},{"$f":"INDEX(MasterTable[],MATCH(Simulator!$E47,MasterTable[P/N],0),COLUMN(MasterTable[V^2]))","v":-3.5200000000000002E-5},{"$f":"INDEX(MasterTable[],MATCH(Simulator!$E47,MasterTable[P/N],0),COLUMN(MasterTable[V]))","v":1.78E-2},{"$f":"INDEX(MasterTable[],MATCH(Simulator!$E47,MasterTable[P/N],0),COLUMN(MasterTable[V0]))","v":22.7},22.905683592298328,{"$f":"INDEX(MasterTable[],MATCH(Simulator!$E47,MasterTable[P/N],0),COLUMN(MasterTable[T^3]))","v":0},{"$f":"INDEX(MasterTable[],MATCH(Simulator!$E47,MasterTable[P/N],0),COLUMN(MasterTable[T^2]))","v":0},{"$f":"INDEX(MasterTable[],MATCH(Simulator!$E47,MasterTable[P/N],0),COLUMN(MasterTable[T]))","v":-1.4E-2},{"$f":"INDEX(MasterTable[],MATCH(Simulator!$E47,MasterTable[P/N],0),COLUMN(MasterTable[T0]))","v":26.85},26.5,22.905683592298331,null,{"$f":"INDEX(MasterTable[],MATCH(Simulator!$E47,MasterTable[P/N],0),COLUMN(MasterTable['# of Die]))","v":18},22.905683592298328,{"$f":"INDEX(Tj_to_Vf6[],MATCH(Simulator!$I$8,Tj_to_Vf6[Vf],1),COLUMN(Tj_to_Vf6[Vf]))","v":-0.5},13.905683592298328,{"$f":"IF(Simulator!$I$8=25,AQ41,AR41)","v":26.5}]
[null,"V13",{"$f":"IF(Simulator!$L$8=\"Case\",Simulator!$I$8,M42)","v":25},{"$f":"Simulator!G48*AR42/1000","v":0.14112006838430208},{"$f":"INDEX(MasterTable[],MATCH(Simulator!E48,MasterTable[P/N],0),COLUMN(MasterTable[Thermal Resistance]))","v":0.22},{"$f":"C42+D42*E42","v":25.031046415044546},null,{"$f":"IF(Simulator!$L$8=\"Case\",F42,Simulator!$I$8)","v":25.031046415044546},{"$f":"Simulator!G48*AW42/1000","v":5.8620068384302046E-2},{"$f":"E42","v":0.22},{"$f":"H42-I42*J42","v":25.018149999999999},null,{"$f":"IF(Simulator!$L$8=\"Case\",Simulator!$I$8,K42)","v":25},{"$f":"IF(Simulator!$L$8=\"Case\",H42,Simulator!$I$8)","v":25.031046415044546},{"$f":"IF(#REF!=\"Tj\",N42,M42)","v":{"$error":"#REF!"}},null,{"$f":"INDEX(MasterTable[],MATCH(Simulator!E48,MasterTable[P/N],0),COLUMN(MasterTable[Typical Lumens]))","v":1900},{"$f":"INDEX(MasterTable[],MATCH(Simulator!$E48,MasterTable[P/N],0),COLUMN(MasterTable[I^3]))","v":0},{"$f":"INDEX(MasterTable[],MATCH(Simulator!$E48,MasterTable[P/N],0),COLUMN(MasterTable[I^2]))","v":-5.2056577008E-7},{"$f":"INDEX(MasterTable[],MATCH(Simulator!$E48,MasterTable[P/N],0),COLUMN(MasterTable[I]))","v":2.2529763468E-3},{"$f":"INDEX(MasterTable[],MATCH(Simulator!$E48,MasterTable[P/N],0),COLUMN(MasterTable[I0]))","v":4.8311928226E-3},{"$f":"(-T42+SQRT(T42^2-4*S42*(U42-AE42)))/(2*S42)","v":7.2511524175160718},{"$f":"INDEX(MasterTable[],MATCH(Simulator!$E48,MasterTable[P/N],0),COLUMN(MasterTable[F^4]))","v":0},{"$f":"INDEX(MasterTable[],MATCH(Simulator!$E48,MasterTable[P/N],0),COLUMN(MasterTable[F^3]))","v":-1.02E-7},{"$f":"INDEX(MasterTable[],MATCH(Simulator!$E48,MasterTable[P/N],0),COLUMN(MasterTable[F^2]))","v":1.27E-5},{"$f":"INDEX(MasterTable[],MATCH(Simulator!$E48,MasterTable[P/N],0),COLUMN(MasterTable[F]))","v":-2.0200000000000001E-3},{"$f":"INDEX(MasterTable[],MATCH(Simulator!$E48,MasterTable[P/N],0),COLUMN(MasterTable[F0]))","v":1.04},{"$f":"IF(Simulator!$I$8=85,Calculations!AE12,W42*M42^4+X42*M42^3+Y42*M42^2+Z42*M42+AA42)","v":0.99584375000000003},{"$f":"Simulator!$O$38/Q42","v":2.1052631578947368E-2},null,2.1140496768642037E-2,{"$f":"INDEX(MasterTable[],MATCH(Simulator!$E48,MasterTable[P/N],0),COLUMN(MasterTable[Typical Voltage]))","v":32.299999999999997},{"$f":"INDEX(MasterTable[],MATCH(Simulator!$E48,MasterTable[P/N],0),COLUMN(MasterTable[V^4]))","v":-9.5076604018999997E-12},{"$f":"INDEX(MasterTable[],MATCH(Simulator!$E48,MasterTable[P/N],0),COLUMN(MasterTable[V^3]))","v":2.4428286607E-8},{"$f":"INDEX(MasterTable[],MATCH(Simulator!$E48,MasterTable[P/N],0),COLUMN(MasterTable[V^2]))","v":-2.3169246580000001E-5},{"$f":"INDEX(MasterTable[],MATCH(Simulator!$E48,MasterTable[P/N],0),COLUMN(MasterTable[V]))","v":1.4970494217E-2},{"$f":"INDEX(MasterTable[],MATCH(Simulator!$E48,MasterTable[P/N],0),COLUMN(MasterTable[V0]))","v":28.116669275},{"$f":"AG42*V42^4+AH42*V42^3+AI42*V42^2+AJ42*V42+AK42","v":28.224013676860409},{"$f":"INDEX(MasterTable[],MATCH(Simulator!$E48,MasterTable[P/N],0),COLUMN(MasterTable[T^3]))","v":0},{"$f":"INDEX(MasterTable[],MATCH(Simulator!$E48,MasterTable[P/N],0),COLUMN(MasterTable[T^2]))","v":0},{"$f":"INDEX(MasterTable[],MATCH(Simulator!$E48,MasterTable[P/N],0),COLUMN(MasterTable[T]))","v":-1.7000000000000001E-2},{"$f":"INDEX(MasterTable[],MATCH(Simulator!$E48,MasterTable[P/N],0),COLUMN(MasterTable[T0]))","v":32.725000000000001},{"$f":"AM42*M42^3+AN42*M42^2+AO42*M42+AP42","v":32.300000000000004},{"$f":"AL42+AQ42-AF42","v":28.224013676860416},null,{"$f":"INDEX(MasterTable[],MATCH(Simulator!$E48,MasterTable[P/N],0),COLUMN(MasterTable['# of Die]))","v":33},{"$f":"AL42","v":28.224013676860409},{"$f":"INDEX(Tj_to_Vf6[],MATCH(Simulator!$I$8,Tj_to_Vf6[Vf],1),COLUMN(Tj_to_Vf6[Vf]))","v":-0.5},{"$f":"AU42+AV42*AT42","v":11.724013676860409},{"$f":"IF(Simulator!$I$8=25,AQ42,AR42)","v":32.300000000000004}]
[null,"V15",{"$f":"IF(Simulator!$L$8=\"Case\",Simulator!$I$8,M43)","v":25},{"$f":"Simulator!G49*AR43/1000","v":0.31302942924703214},{"$f":"INDEX(MasterTable[],MATCH(Simulator!E49,MasterTable[P/N],0),COLUMN(MasterTable[Thermal Resistance]))","v":0.16},25.050084708679524,null,{"$f":"IF(Simulator!$L$8=\"Case\",F43,Simulator!$I$8)","v":25.050084708679524},{"$f":"Simulator!G49*AW43/1000","v":7.3029429247032096E-2},0.16,25.038399999999999,null,{"$f":"IF(Simulator!$L$8=\"Case\",Simulator!$I$8,K43)","v":25},{"$f":"IF(Simulator!$L$8=\"Case\",H43,Simulator!$I$8)","v":25.050084708679524},{"$f":"IF(#REF!=\"Tj\",N43,M43)","v":{"$error":"#REF!"}},null,{"$f":"INDEX(MasterTable[],MATCH(Simulator!E49,MasterTable[P/N],0),COLUMN(MasterTable[Typical Lumens]))","v":2822},{"$f":"INDEX(MasterTable[],MATCH(Simulator!$E49,MasterTable[P/N],0),COLUMN(MasterTable[I^3]))","v":0},{"$f":"INDEX(MasterTable[],MATCH(Simulator!$E49,MasterTable[P/N],0),COLUMN(MasterTable[I^2]))","v":-2.826E-7},{"$f":"INDEX(MasterTable[],MATCH(Simulator!$E49,MasterTable[P/N],0),COLUMN(MasterTable[I]))","v":1.6303876000000001E-3},{"$f":"INDEX(MasterTable[],MATCH(Simulator!$E49,MasterTable[P/N],0),COLUMN(MasterTable[I0]))","v":0},{"$f":"(-T43+SQRT(T43^2-4*S43*(U43-AE43)))/(2*S43)","v":8.7301929408264609},{"$f":"INDEX(MasterTable[],MATCH(Simulator!$E49,MasterTable[P/N],0),COLUMN(MasterTable[F^4]))","v":0},{"$f":"INDEX(MasterTable[],MATCH(Simulator!$E49,MasterTable[P/N],0),COLUMN(MasterTable[F^3]))","v":0},{"$f":"INDEX(MasterTable[],MATCH(Simulator!$E49,MasterTable[P/N],0),COLUMN(MasterTable[F^2]))","v":-5.2610000000000001E-6},{"$f":"INDEX(MasterTable[],MATCH(Simulator!$E49,MasterTable[P/N],0),COLUMN(MasterTable[F]))","v":-1.1508107E-3},{"$f":"INDEX(MasterTable[],MATCH(Simulator!$E49,MasterTable[P/N],0),COLUMN(MasterTable[F0]))","v":1.0294046488999999},{"$f":"IF(Simulator!$I$8=85,Calculations!AE13,W43*M43^4+X43*M43^3+Y43*M43^2+Z43*M43+AA43)","v":0.99734625639999996},{"$f":"Simulator!$O$38/Q43","v":1.4174344436569808E-2},null,{"$f":"AC43/AB43","v":1.4212059598772871E-2},{"$f":"INDEX(MasterTable[],MATCH(Simulator!$E49,MasterTable[P/N],0),COLUMN(MasterTable[Typical Voltage]))","v":36},{"$f":"INDEX(MasterTable[],MATCH(Simulator!$E49,MasterTable[P/N],0),COLUMN(MasterTable[V^4]))","v":-2.6999999999999998E-12},{"$f":"INDEX(MasterTable[],MATCH(Simulator!$E49,MasterTable[P/N],0),COLUMN(MasterTable[V^3]))","v":9.5399999999999997E-9},{"$f":"INDEX(MasterTable[],MATCH(Simulator!$E49,MasterTable[P/N],0),COLUMN(MasterTable[V^2]))","v":-1.2500000000000001E-5},{"$f":"INDEX(MasterTable[],MATCH(Simulator!$E49,MasterTable[P/N],0),COLUMN(MasterTable[V]))","v":1.1900000000000001E-2},{"$f":"INDEX(MasterTable[],MATCH(Simulator!$E49,MasterTable[P/N],0),COLUMN(MasterTable[V0]))","v":31.2},{"$f":"AG43*V43^4+AH43*V43^3+AI43*V43^2+AJ43*V43+AK43","v":31.30294292470321},{"$f":"INDEX(MasterTable[],MATCH(Simulator!$E49,MasterTable[P/N],0),COLUMN(MasterTable[T^3]))","v":0},{"$f":"INDEX(MasterTable[],MATCH(Simulator!$E49,MasterTable[P/N],0),COLUMN(MasterTable[T^2]))","v":0},{"$f":"INDEX(MasterTable[],MATCH(Simulator!$E49,MasterTable[P/N],0),COLUMN(MasterTable[T]))","v":-1.7000000000000001E-2},{"$f":"INDEX(MasterTable[],MATCH(Simulator!$E49,MasterTable[P/N],0),COLUMN(MasterTable[T0]))","v":36.424999999999997},{"$f":"AM43*M43^3+AN43*M43^2+AO43*M43+AP43","v":36},{"$f":"AL43+AQ43-AF43","v":31.302942924703217},null,{"$f":"INDEX(MasterTable[],MATCH(Simulator!$E49,MasterTable[P/N],0),COLUMN(MasterTable['# of Die]))","v":48},{"$f":"AL43","v":31.30294292470321},{"$f":"INDEX(Tj_to_Vf6[],MATCH(Simulator!$I$8,Tj_to_Vf6[Vf],1),COLUMN(Tj_to_Vf6[Vf]))","v":-0.5},{"$f":"AU43+AV43*AT43","v":7.3029429247032098},{"$f":"IF(Simulator!$I$8=25,AQ43,AR43)","v":36}]
[null,"V18",{"$f":"IF(Simulator!$L$8=\"Case\",Simulator!$I$8,M44)","v":25},{"$f":"Simulator!G50*AR44/1000","v":0.12782490512723299},{"$f":"INDEX(MasterTable[],MATCH(Simulator!E50,MasterTable[P/N],0),COLUMN(MasterTable[Thermal Resistance]))","v":0.13},{"$f":"C44+D44*E44","v":25.016617237666541},null,{"$f":"IF(Simulator!$L$8=\"Case\",F44,Simulator!$I$8)","v":25.016617237666541},{"$f":"Simulator!G50*AW44/1000","v":-2.2175094872767021E-2},{"$f":"E44","v":0.13},{"$f":"H44-I44*J44","v":25.019500000000001},null,{"$f":"IF(Simulator!$L$8=\"Case\",Simulator!$I$8,K44)","v":25},{"$f":"IF(Simulator!$L$8=\"Case\",H44,Simulator!$I$8)","v":25.016617237666541},{"$f":"IF(#REF!=\"Tj\",N44,M44)","v":{"$error":"#REF!"}},null,{"$f":"INDEX(MasterTable[],MATCH(Simulator!E50,MasterTable[P/N],0),COLUMN(MasterTable[Typical Lumens]))","v":3670},{"$f":"INDEX(MasterTable[],MATCH(Simulator!$E50,MasterTable[P/N],0),COLUMN(MasterTable[I^3]))","v":0},{"$f":"INDEX(MasterTable[],MATCH(Simulator!$E50,MasterTable[P/N],0),COLUMN(MasterTable[I^2]))","v":-1.3106025059999999E-7},{"$f":"INDEX(MasterTable[],MATCH(Simulator!$E50,MasterTable[P/N],0),COLUMN(MasterTable[I]))","v":1.0878699984E-3},{"$f":"INDEX(MasterTable[],MATCH(Simulator!$E50,MasterTable[P/N],0),COLUMN(MasterTable[I0]))","v":4.2883455537999996E-3},6.0947327510334501,{"$f":"INDEX(MasterTable[],MATCH(Simulator!$E50,MasterTable[P/N],0),COLUMN(MasterTable[F^4]))","v":0},{"$f":"INDEX(MasterTable[],MATCH(Simulator!$E50,MasterTable[P/N],0),COLUMN(MasterTable[F^3]))","v":-1.8425800000000001E-7},{"$f":"INDEX(MasterTable[],MATCH(Simulator!$E50,MasterTable[P/N],0),COLUMN(MasterTable[F^2]))","v":2.5068200000000002E-5},{"$f":"INDEX(MasterTable[],MATCH(Simulator!$E50,MasterTable[P/N],0),COLUMN(MasterTable[F]))","v":-2.5901499999999998E-3},{"$f":"INDEX(MasterTable[],MATCH(Simulator!$E50,MasterTable[P/N],0),COLUMN(MasterTable[F0]))","v":1.05063},{"$f":"IF(Simulator!$I$8=85,Calculations!AE14,W44*M44^4+X44*M44^3+Y44*M44^2+Z44*M44+AA44)","v":0.99866484374999998},{"$f":"Simulator!$O$38/Q44","v":1.0899182561307902E-2},null,1.0913754128343323E-2,{"$f":"INDEX(MasterTable[],MATCH(Simulator!$E50,MasterTable[P/N],0),COLUMN(MasterTable[Typical Voltage]))","v":29.5},{"$f":"INDEX(MasterTable[],MATCH(Simulator!$E50,MasterTable[P/N],0),COLUMN(MasterTable[V^4]))","v":-4.3296141676000001E-13},{"$f":"INDEX(MasterTable[],MATCH(Simulator!$E50,MasterTable[P/N],0),COLUMN(MasterTable[V^3]))","v":2.4210131023999999E-9},{"$f":"INDEX(MasterTable[],MATCH(Simulator!$E50,MasterTable[P/N],0),COLUMN(MasterTable[V^2]))","v":-5.0293161703999997E-6},{"$f":"INDEX(MasterTable[],MATCH(Simulator!$E50,MasterTable[P/N],0),COLUMN(MasterTable[V]))","v":6.8884526139999999E-3},{"$f":"INDEX(MasterTable[],MATCH(Simulator!$E50,MasterTable[P/N],0),COLUMN(MasterTable[V0]))","v":25.523184017999998},25.564981025446595,{"$f":"INDEX(MasterTable[],MATCH(Simulator!$E50,MasterTable[P/N],0),COLUMN(MasterTable[T^3]))","v":0},{"$f":"INDEX(MasterTable[],MATCH(Simulator!$E50,MasterTable[P/N],0),COLUMN(MasterTable[T^2]))","v":0},{"$f":"INDEX(MasterTable[],MATCH(Simulator!$E50,MasterTable[P/N],0),COLUMN(MasterTable[T]))","v":-1.4999999999999999E-2},{"$f":"INDEX(MasterTable[],MATCH(Simulator!$E50,MasterTable[P/N],0),COLUMN(MasterTable[T0]))","v":29.875},29.5,25.564981025446599,null,{"$f":"INDEX(MasterTable[],MATCH(Simulator!$E50,MasterTable[P/N],0),COLUMN(MasterTable['# of Die]))","v":60},25.564981025446595,{"$f":"INDEX(Tj_to_Vf6[],MATCH(Simulator!$I$8,Tj_to_Vf6[Vf],1),COLUMN(Tj_to_Vf6[Vf]))","v":-0.5},-4.4350189745534045,{"$f":"IF(Simulator!$I$8=25,AQ44,AR44)","v":29.5}]
[null,"V22",{"$f":"IF(Simulator!$L$8=\"Case\",Simulator!$I$8,M45)","v":25},{"$f":"Simulator!G51*AR45/1000","v":{"$error":"#VALUE!"}},{"$f":"INDEX(MasterTable[],MATCH(Simulator!E51,MasterTable[P/N],0),COLUMN(MasterTable[Thermal Resistance]))","v":{"$error":"#N/A"}},{"$f":"C45+D45*E45","v":{"$error":"#VALUE!"}},null,{"$f":"IF(Simulator!$L$8=\"Case\",F45,Simulator!$I$8)","v":{"$error":"#VALUE!"}},{"$f":"Simulator!G51*AW45/1000","v":{"$error":"#VALUE!"}},{"$f":"E45","v":{"$error":"#N/A"}},{"$f":"H45-I45*J45","v":{"$error":"#VALUE!"}},null,{"$f":"IF(Simulator!$L$8=\"Case\",Simulator!$I$8,K45)","v":25},{"$f":"IF(Simulator!$L$8=\"Case\",H45,Simulator!$I$8)","v":{"$error":"#VALUE!"}},{"$f":"IF(#REF!=\"Tj\",N45,M45)","v":{"$error":"#REF!"}},null,{"$f":"INDEX(MasterTable[],MATCH(Simulator!E51,MasterTable[P/N],0),COLUMN(MasterTable[Typical Lumens]))","v":{"$error":"#N/A"}},{"$f":"INDEX(MasterTable[],MATCH(Simulator!$E51,MasterTable[P/N],0),COLUMN(MasterTable[I^3]))","v":{"$error":"#N/A"}},{"$f":"INDEX(MasterTable[],MATCH(Simulator!$E51,MasterTable[P/N],0),COLUMN(MasterTable[I^2]))","v":{"$error":"#N/A"}},{"$f":"INDEX(MasterTable[],MATCH(Simulator!$E51,MasterTable[P/N],0),COLUMN(MasterTable[I]))","v":{"$error":"#N/A"}},{"$f":"INDEX(MasterTable[],MATCH(Simulator!$E51,MasterTable[P/N],0),COLUMN(MasterTable[I0]))","v":{"$error":"#N/A"}},{"$f":"(-T45+SQRT(T45^2-4*S45*(U45-AE45)))/(2*S45)","v":{"$error":"#N/A"}},{"$f":"INDEX(MasterTable[],MATCH(Simulator!$E51,MasterTable[P/N],0),COLUMN(MasterTable[F^4]))","v":{"$error":"#N/A"}},{"$f":"INDEX(MasterTable[],MATCH(Simulator!$E51,MasterTable[P/N],0),COLUMN(MasterTable[F^3]))","v":{"$error":"#N/A"}},{"$f":"INDEX(MasterTable[],MATCH(Simulator!$E51,MasterTable[P/N],0),COLUMN(MasterTable[F^2]))","v":{"$error":"#N/A"}},{"$f":"INDEX(MasterTable[],MATCH(Simulator!$E51,MasterTable[P/N],0),COLUMN(MasterTable[F]))","v":{"$error":"#N/A"}},{"$f":"INDEX(MasterTable[],MATCH(Simulator!$E51,MasterTable[P/N],0),COLUMN(MasterTable[F0]))","v":{"$error":"#N/A"}},{"$f":"IF(Simulator!$I$8=85,Calculations!AE15,W45*M45^4+X45*M45^3+Y45*M45^2+Z45*M45+AA45)","v":{"$error":"#N/A"}},{"$f":"Simulator!$O$38/Q45","v":{"$error":"#N/A"}},null,{"$f":"AC45/AB45","v":{"$error":"#N/A"}},{"$f":"INDEX(MasterTable[],MATCH(Simulator!$E51,MasterTable[P/N],0),COLUMN(MasterTable[Typical Voltage]))","v":{"$error":"#N/A"}},{"$f":"INDEX(MasterTable[],MATCH(Simulator!$E51,MasterTable[P/N],0),COLUMN(MasterTable[V^4]))","v":{"$error":"#N/A"}},{"$f":"INDEX(MasterTable[],MATCH(Simulator!$E51,MasterTable[P/N],0),COLUMN(MasterTable[V^3]))","v":{"$error":"#N/A"}},{"$f":"INDEX(MasterTable[],MATCH(Simulator!$E51,MasterTable[P/N],0),COLUMN(MasterTable[V^2]))","v":{"$error":"#N/A"}},{"$f":"INDEX(MasterTable[],MATCH(Simulator!$E51,MasterTable[P/N],0),COLUMN(MasterTable[V]))","v":{"$error":"#N/A"}},{"$f":"INDEX(MasterTable[],MATCH(Simulator!$E51,MasterTable[P/N],0),COLUMN(MasterTable[V0]))","v":{"$error":"#N/A"}},{"$f":"AG45*V45^4+AH45*V45^3+AI45*V45^2+AJ45*V45+AK45","v":{"$error":"#N/A"}},{"$f":"INDEX(MasterTable[],MATCH(Simulator!$E51,MasterTable[P/N],0),COLUMN(MasterTable[T^3]))","v":{"$error":"#N/A"}},{"$f":"INDEX(MasterTable[],MATCH(Simulator!$E51,MasterTable[P/N],0),COLUMN(MasterTable[T^2]))","v":{"$error":"#N/A"}},{"$f":"INDEX(MasterTable[],MATCH(Simulator!$E51,MasterTable[P/N],0),COLUMN(MasterTable[T]))","v":{"$error":"#N/A"}},{"$f":"INDEX(MasterTable[],MATCH(Simulator!$E51,MasterTable[P/N],0),COLUMN(MasterTable[T0]))","v":{"$error":"#N/A"}},{"$f":"AM45*M45^3+AN45*M45^2+AO45*M45+AP45","v":{"$error":"#N/A"}},{"$f":"AL45+AQ45-AF45","v":{"$error":"#N/A"}},null,{"$f":"INDEX(MasterTable[],MATCH(Simulator!$E51,MasterTable[P/N],0),COLUMN(MasterTable['# of Die]))","v":{"$error":"#N/A"}},{"$f":"AL45","v":{"$error":"#N/A"}},{"$f":"INDEX(Tj_to_Vf6[],MATCH(Simulator!$I$8,Tj_to_Vf6[Vf],1),COLUMN(Tj_to_Vf6[Vf]))","v":-0.5},{"$f":"AU45+AV45*AT45","v":{"$error":"#N/A"}},{"$f":"IF(Simulator!$I$8=25,AQ45,AR45)","v":{"$error":"#N/A"}}]
[]
["Calculations using Lumen Input",null,"Converting Tc to Tj",null,null,null,null,"Converting Tj to Tc",null,null,null,null,null,null,null,null,"Calculating Current",null,null,null,null,null,null,null,null,null,null,null,null,null,null,"Calculating Voltage w/ Tc",null,null,null,null,null,null,null,null,null,null,null,null,null,null,"Calculating Voltage w/ Tj"]
[null,null,"Tj = Tc + Power*Thermal Resistance",null,null,null,null,"Tc = Tj - Power*Thermal Resistance",null,null,null,null,null,null,null,null,"I=Fr@I*Eqn; Fr@I=Fro/Fr@T",null,null,null,null,null,null,null,null,null,null,null,null,null,null,"Vf@Tc&I = Vf@I + Vf@Tc-Vft",null,null,null,null,null,null,null,null,null,null,null,null,null,null,"Vf@Tj&I = Vf@I + Vf@Tj Modifier"]
[null,null,"Tc","Power","Thermal Resistance","Tc>>Tj",null,"Tj","Power","Thermal Resistance","Tj>>Tc",null,"Tc","Tj",{"$f":"IF(Simulator!$L$8=\"Case\",\"Tj\",\"Tc\")","v":"Tj"},null,"Ft","Fr@I Eqn",null,null,null,"Req'd I",null,"Fr@Tc Eqn",null,null,null,"Fr@Tc","Fro",null,"Fr@I","Vft",null,"Vf@I Eqn",null,null,null,"Vf@I","Vf@Tc Eqn",null,null,null,"Vf@Tc","Vf@Tc&I",null,"# of Die","Vf@I","Vf@Tj Modifier, per Die","Vf@Tj&I","Voltage Report"]
[null,"Vero 10",{"$f":"IF(Simulator!$L$8=\"Case\",Simulator!$I$8,M50)","v":25},{"$f":"Simulator!G53*AR50/1000","v":0.22904156163147918},{"$f":"INDEX(MasterTable[],MATCH(Simulator!E53,MasterTable[P/N],0),COLUMN(MasterTable[Thermal Resistance]))","v":0.47},{"$f":"C50+D50*E50","v":25.107649533966796},null,{"$f":"IF(Simulator!$L$8=\"Case\",F50,Simulator!$I$8)","v":25.107649533966796},{"$f":"Simulator!G53*AW50/1000","v":0.16904156163147918},{"$f":"E50","v":0.47},{"$f":"H50-I50*J50","v":25.028200000000002},null,{"$f":"IF(Simulator!$L$8=\"Case\",Simulator!$I$8,K50)","v":25},{"$f":"IF(Simulator!$L$8=\"Case\",H50,Simulator!$I$8)","v":25.107649533966796},{"$f":"IF(#REF!=\"Tj\",N50,M50)","v":{"$error":"#REF!"}},null,{"$f":"INDEX(MasterTable[],MATCH(Simulator!E53,MasterTable[P/N],0),COLUMN(MasterTable[Typical Lumens]))","v":1076},null,{"$f":"INDEX(MasterTable[],MATCH(Simulator!$E53,MasterTable[P/N],0),COLUMN(MasterTable[I^2]))","v":-9.0240000000000003E-7},{"$f":"INDEX(MasterTable[],MATCH(Simulator!$E53,MasterTable[P/N],0),COLUMN(MasterTable[I]))","v":3.1841790000000001E-3},{"$f":"INDEX(MasterTable[],MATCH(Simulator!$E53,MasterTable[P/N],0),COLUMN(MasterTable[I0]))","v":0},{"$f":"(-T50+SQRT(T50^2-4*S50*(U50-AE50)))/(2*S50)","v":11.736918861467364},{"$f":"INDEX(MasterTable[],MATCH(Simulator!$E53,MasterTable[P/N],0),COLUMN(MasterTable[F^4]))","v":0},{"$f":"INDEX(MasterTable[],MATCH(Simulator!$E53,MasterTable[P/N],0),COLUMN(MasterTable[F^3]))","v":0},{"$f":"INDEX(MasterTable[],MATCH(Simulator!$E53,MasterTable[P/N],0),COLUMN(MasterTable[F^2]))","v":-6.2593999999999997E-6},{"$f":"INDEX(MasterTable[],MATCH(Simulator!$E53,MasterTable[P/N],0),COLUMN(MasterTable[F]))","v":-1.184453E-3},{"$f":"INDEX(MasterTable[],MATCH(Simulator!$E53,MasterTable[P/N],0),COLUMN(MasterTable[F0]))","v":1.0315523711000001},{"$f":"IF(Simulator!$I$8=85,AE20,W50*M50^4+X50*M50^3+Y50*M50^2+Z50*M50+AA50)","v":0.99802892110000008},{"$f":"Simulator!$O$38/Q50","v":3.717472118959108E-2},null,{"$f":"AC50/AB50","v":3.7248140212828823E-2},{"$f":"INDEX(MasterTable[],MATCH(Simulator!$E53,MasterTable[P/N],0),COLUMN(MasterTable[Typical Voltage]))","v":26.5},{"$f":"INDEX(MasterTable[],MATCH(Simulator!$E53,MasterTable[P/N],0),COLUMN(MasterTable[V^4]))","v":-3.2099999999999998E-11},{"$f":"INDEX(MasterTable[],MATCH(Simulator!$E53,MasterTable[P/N],0),COLUMN(MasterTable[V^3]))","v":5.4800000000000001E-8},{"$f":"INDEX(MasterTable[],MATCH(Simulator!$E53,MasterTable[P/N],0),COLUMN(MasterTable[V^2]))","v":-3.5200000000000002E-5},{"$f":"INDEX(MasterTable[],MATCH(Simulator!$E53,MasterTable[P/N],0),COLUMN(MasterTable[V]))","v":1.78E-2},{"$f":"INDEX(MasterTable[],MATCH(Simulator!$E53,MasterTable[P/N],0),COLUMN(MasterTable[V0]))","v":22.7},{"$f":"AG50*V50^4+AH50*V50^3+AI50*V50^2+AJ50*V50+AK50","v":22.904156163147917},{"$f":"INDEX(MasterTable[],MATCH(Simulator!$E53,MasterTable[P/N],0),COLUMN(MasterTable[T^3]))","v":0},{"$f":"INDEX(MasterTable[],MATCH(Simulator!$E53,MasterTable[P/N],0),COLUMN(MasterTable[T^2]))","v":0},{"$f":"INDEX(MasterTable[],MATCH(Simulator!$E53,MasterTable[P/N],0),COLUMN(MasterTable[T]))","v":-1.4E-2},{"$f":"INDEX(MasterTable[],MATCH(Simulator!$E53,MasterTable[P/N],0),COLUMN(MasterTable[T0]))","v":26.85},{"$f":"AM50*M50^3+AN50*M50^2+AO50*M50+AP50","v":26.5},{"$f":"AL50+AQ50-AF50","v":22.904156163147917},null,{"$f":"INDEX(MasterTable[],MATCH(Simulator!$E53,MasterTable[P/N],0),COLUMN(MasterTable['# of Die]))","v":12},{"$f":"AL50","v":22.904156163147917},{"$f":"INDEX(Tj_to_Vf6[],MATCH(Simulator!$I$8,Tj_to_Vf6[Vf],1),COLUMN(Tj_to_Vf6[Vf]))","v":-0.5},{"$f":"AU50+AV50*AT50","v":16.904156163147917},{"$f":"IF(Simulator!$I$8=25,AQ50,AR50)","v":26.5}]
[null,"Vero 13",{"$f":"IF(Simulator!$L$8=\"Case\",Simulator!$I$8,M51)","v":25},{"$f":"Simulator!G54*AR51/1000","v":0.14112006838430208},{"$f":"INDEX(MasterTable[],MATCH(Simulator!E54,MasterTable[P/N],0),COLUMN(MasterTable[Thermal Resistance]))","v":0.22},{"$f":"C51+D51*E51","v":25.031046415044546},null,{"$f":"IF(Simulator!$L$8=\"Case\",F51,Simulator!$I$8)","v":25.031046415044546},{"$f":"Simulator!G54*AW51/1000","v":5.8620068384302046E-2},{"$f":"E51","v":0.22},{"$f":"H51-I51*J51","v":25.018149999999999},null,{"$f":"IF(Simulator!$L$8=\"Case\",Simulator!$I$8,K51)","v":25},{"$f":"IF(Simulator!$L$8=\"Case\",H51,Simulator!$I$8)","v":25.031046415044546},{"$f":"IF(#REF!=\"Tj\",N51,M51)","v":{"$error":"#REF!"}},null,{"$f":"INDEX(MasterTable[],MATCH(Simulator!E54,MasterTable[P/N],0),COLUMN(MasterTable[Typical Lumens]))","v":1900},null,{"$f":"INDEX(MasterTable[],MATCH(Simulator!$E54,MasterTable[P/N],0),COLUMN(MasterTable[I^2]))","v":-5.2056577008E-7},{"$f":"INDEX(MasterTable[],MATCH(Simulator!$E54,MasterTable[P/N],0),COLUMN(MasterTable[I]))","v":2.2529763468E-3},{"$f":"INDEX(MasterTable[],MATCH(Simulator!$E54,MasterTable[P/N],0),COLUMN(MasterTable[I0]))","v":4.8311928226E-3},{"$f":"(-T51+SQRT(T51^2-4*S51*(U51-AE51)))/(2*S51)","v":7.2511524175160718},{"$f":"INDEX(MasterTable[],MATCH(Simulator!$E54,MasterTable[P/N],0),COLUMN(MasterTable[F^4]))","v":0},{"$f":"INDEX(MasterTable[],MATCH(Simulator!$E54,MasterTable[P/N],0),COLUMN(MasterTable[F^3]))","v":-1.02E-7},{"$f":"INDEX(MasterTable[],MATCH(Simulator!$E54,MasterTable[P/N],0),COLUMN(MasterTable[F^2]))","v":1.27E-5},{"$f":"INDEX(MasterTable[],MATCH(Simulator!$E54,MasterTable[P/N],0),COLUMN(MasterTable[F]))","v":-2.0200000000000001E-3},{"$f":"INDEX(MasterTable[],MATCH(Simulator!$E54,MasterTable[P/N],0),COLUMN(MasterTable[F0]))","v":1.04},{"$f":"IF(Simulator!$I$8=85,AE21,W51*M51^4+X51*M51^3+Y51*M51^2+Z51*M51+AA51)","v":0.99584375000000003},{"$f":"Simulator!$O$38/Q51","v":2.1052631578947368E-2},null,{"$f":"AC51/AB51","v":2.1140496768642037E-2},{"$f":"INDEX(MasterTable[],MATCH(Simulator!$E54,MasterTable[P/N],0),COLUMN(MasterTable[Typical Voltage]))","v":32.299999999999997},{"$f":"INDEX(MasterTable[],MATCH(Simulator!$E54,MasterTable[P/N],0),COLUMN(MasterTable[V^4]))","v":-9.5076604018999997E-12},{"$f":"INDEX(MasterTable[],MATCH(Simulator!$E54,MasterTable[P/N],0),COLUMN(MasterTable[V^3]))","v":2.4428286607E-8},{"$f":"INDEX(MasterTable[],MATCH(Simulator!$E54,MasterTable[P/N],0),COLUMN(MasterTable[V^2]))","v":-2.3169246580000001E-5},{"$f":"INDEX(MasterTable[],MATCH(Simulator!$E54,MasterTable[P/N],0),COLUMN(MasterTable[V]))","v":1.4970494217E-2},{"$f":"INDEX(MasterTable[],MATCH(Simulator!$E54,MasterTable[P/N],0),COLUMN(MasterTable[V0]))","v":28.116669275},{"$f":"AG51*V51^4+AH51*V51^3+AI51*V51^2+AJ51*V51+AK51","v":28.224013676860409},{"$f":"INDEX(MasterTable[],MATCH(Simulator!$E54,MasterTable[P/N],0),COLUMN(MasterTable[T^3]))","v":0},{"$f":"INDEX(MasterTable[],MATCH(Simulator!$E54,MasterTable[P/N],0),COLUMN(MasterTable[T^2]))","v":0},{"$f":"INDEX(MasterTable[],MATCH(Simulator!$E54,MasterTable[P/N],0),COLUMN(MasterTable[T]))","v":-1.7000000000000001E-2},{"$f":"INDEX(MasterTable[],MATCH(Simulator!$E54,MasterTable[P/N],0),COLUMN(MasterTable[T0]))","v":32.725000000000001},32.300000000000004,{"$f":"AL51+AQ51-AF51","v":28.224013676860416},null,{"$f":"INDEX(MasterTable[],MATCH(Simulator!$E54,MasterTable[P/N],0),COLUMN(MasterTable['# of Die]))","v":33},{"$f":"AL51","v":28.224013676860409},{"$f":"INDEX(Tj_to_Vf6[],MATCH(Simulator!$I$8,Tj_to_Vf6[Vf],1),COLUMN(Tj_to_Vf6[Vf]))","v":-0.5},{"$f":"AU51+AV51*AT51","v":11.724013676860409},{"$f":"IF(Simulator!$I$8=25,AQ51,AR51)","v":32.300000000000004}]
[null,"Vero 18",{"$f":"IF(Simulator!$L$8=\"Case\",Simulator!$I$8,M52)","v":25},{"$f":"Simulator!G55*AR52/1000","v":0.12782490512723299},{"$f":"INDEX(MasterTable[],MATCH(Simulator!E55,MasterTable[P/N],0),COLUMN(MasterTable[Thermal Resistance]))","v":0.13},{"$f":"C52+D52*E52","v":25.016617237666541},null,{"$f":"IF(Simulator!$L$8=\"Case\",F52,Simulator!$I$8)","v":25.016617237666541},{"$f":"Simulator!G55*AW52/1000","v":-2.2175094872767021E-2},{"$f":"E52","v":0.13},{"$f":"H52-I52*J52","v":25.019500000000001},null,{"$f":"IF(Simulator!$L$8=\"Case\",Simulator!$I$8,K52)","v":25},{"$f":"IF(Simulator!$L$8=\"Case\",H52,Simulator!$I$8)","v":25.016617237666541},{"$f":"IF(#REF!=\"Tj\",N52,M52)","v":{"$error":"#REF!"}},null,{"$f":"INDEX(MasterTable[],MATCH(Simulator!E55,MasterTable[P/N],0),COLUMN(MasterTable[Typical Lumens]))","v":3670},null,{"$f":"INDEX(MasterTable[],MATCH(Simulator!$E55,MasterTable[P/N],0),COLUMN(MasterTable[I^2]))","v":-1.3106025059999999E-7},{"$f":"INDEX(MasterTable[],MATCH(Simulator!$E55,MasterTable[P/N],0),COLUMN(MasterTable[I]))","v":1.0878699984E-3},{"$f":"INDEX(MasterTable[],MATCH(Simulator!$E55,MasterTable[P/N],0),COLUMN(MasterTable[I0]))","v":4.2883455537999996E-3},{"$f":"(-T52+SQRT(T52^2-4*S52*(U52-AE52)))/(2*S52)","v":6.0947327510334501},{"$f":"INDEX(MasterTable[],MATCH(Simulator!$E55,MasterTable[P/N],0),COLUMN(MasterTable[F^4]))","v":0},{"$f":"INDEX(MasterTable[],MATCH(Simulator!$E55,MasterTable[P/N],0),COLUMN(MasterTable[F^3]))","v":-1.8425800000000001E-7},{"$f":"INDEX(MasterTable[],MATCH(Simulator!$E55,MasterTable[P/N],0),COLUMN(MasterTable[F^2]))","v":2.5068200000000002E-5},{"$f":"INDEX(MasterTable[],MATCH(Simulator!$E55,MasterTable[P/N],0),COLUMN(MasterTable[F]))","v":-2.5901499999999998E-3},{"$f":"INDEX(MasterTable[],MATCH(Simulator!$E55,MasterTable[P/N],0),COLUMN(MasterTable[F0]))","v":1.05063},{"$f":"IF(Simulator!$I$8=85,AE22,W52*M52^4+X52*M52^3+Y52*M52^2+Z52*M52+AA52)","v":0.99866484374999998},{"$f":"Simulator!$O$38/Q52","v":1.0899182561307902E-2},null,{"$f":"AC52/AB52","v":1.0913754128343323E-2},{"$f":"INDEX(MasterTable[],MATCH(Simulator!$E55,MasterTable[P/N],0),COLUMN(MasterTable[Typical Voltage]))","v":29.5},{"$f":"INDEX(MasterTable[],MATCH(Simulator!$E55,MasterTable[P/N],0),COLUMN(MasterTable[V^4]))","v":-4.3296141676000001E-13},{"$f":"INDEX(MasterTable[],MATCH(Simulator!$E55,MasterTable[P/N],0),COLUMN(MasterTable[V^3]))","v":2.4210131023999999E-9},{"$f":"INDEX(MasterTable[],MATCH(Simulator!$E55,MasterTable[P/N],0),COLUMN(MasterTable[V^2]))","v":-5.0293161703999997E-6},{"$f":"INDEX(MasterTable[],MATCH(Simulator!$E55,MasterTable[P/N],0),COLUMN(MasterTable[V]))","v":6.8884526139999999E-3},{"$f":"INDEX(MasterTable[],MATCH(Simulator!$E55,MasterTable[P/N],0),COLUMN(MasterTable[V0]))","v":25.523184017999998},25.564981025446595,{"$f":"INDEX(MasterTable[],MATCH(Simulator!$E55,MasterTable[P/N],0),COLUMN(MasterTable[T^3]))","v":0},{"$f":"INDEX(MasterTable[],MATCH(Simulator!$E55,MasterTable[P/N],0),COLUMN(MasterTable[T^2]))","v":0},{"$f":"INDEX(MasterTable[],MATCH(Simulator!$E55,MasterTable[P/N],0),COLUMN(MasterTable[T]))","v":-1.4999999999999999E-2},{"$f":"INDEX(MasterTable[],MATCH(Simulator!$E55,MasterTable[P/N],0),COLUMN(MasterTable[T0]))","v":29.875},{"$f":"AM52*M52^3+AN52*M52^2+AO52*M52+AP52","v":29.5},25.564981025446599,null,{"$f":"INDEX(MasterTable[],MATCH(Simulator!$E55,MasterTable[P/N],0),COLUMN(MasterTable['# of Die]))","v":60},{"$f":"AL52","v":25.564981025446595},{"$f":"INDEX(Tj_to_Vf6[],MATCH(Simulator!$I$8,Tj_to_Vf6[Vf],1),COLUMN(Tj_to_Vf6[Vf]))","v":-0.5},{"$f":"AU52+AV52*AT52","v":-4.4350189745534045},{"$f":"IF(Simulator!$I$8=25,AQ52,AR52)","v":29.5}]
[null,"Vero 29",{"$f":"IF(Simulator!$L$8=\"Case\",Simulator!$I$8,M53)","v":25},{"$f":"Simulator!G56*AR53/1000","v":0.32838461324960178},{"$f":"INDEX(MasterTable[],MATCH(Simulator!E56,MasterTable[P/N],0),COLUMN(MasterTable[Thermal Resistance]))","v":0.06},{"$f":"C53+D53*E53","v":25.019703076794976},null,{"$f":"IF(Simulator!$L$8=\"Case\",F53,Simulator!$I$8)","v":25.019703076794976},{"$f":"Simulator!G56*AW53/1000","v":-0.45161538675039814},{"$f":"E53","v":0.06},{"$f":"H53-I53*J53","v":25.046800000000001},null,{"$f":"IF(Simulator!$L$8=\"Case\",Simulator!$I$8,K53)","v":25},{"$f":"IF(Simulator!$L$8=\"Case\",H53,Simulator!$I$8)","v":25.019703076794976},{"$f":"IF(#REF!=\"Tj\",N53,M53)","v":{"$error":"#REF!"}},null,{"$f":"INDEX(MasterTable[],MATCH(Simulator!E56,MasterTable[P/N],0),COLUMN(MasterTable[Typical Lumens]))","v":9415},null,{"$f":"INDEX(MasterTable[],MATCH(Simulator!$E56,MasterTable[P/N],0),COLUMN(MasterTable[I^2]))","v":-3.6683947658000001E-8},{"$f":"INDEX(MasterTable[],MATCH(Simulator!$E56,MasterTable[P/N],0),COLUMN(MasterTable[I]))","v":5.5936581253000002E-4},{"$f":"INDEX(MasterTable[],MATCH(Simulator!$E56,MasterTable[P/N],0),COLUMN(MasterTable[I0]))","v":0},{"$f":"(-T53+SQRT(T53^2-4*S53*(U53-AE53)))/(2*S53)","v":7.5974322393090326},{"$f":"INDEX(MasterTable[],MATCH(Simulator!$E56,MasterTable[P/N],0),COLUMN(MasterTable[F^4]))","v":-4.0380200000000001E-9},{"$f":"INDEX(MasterTable[],MATCH(Simulator!$E56,MasterTable[P/N],0),COLUMN(MasterTable[F^3]))","v":6.48277E-7},{"$f":"INDEX(MasterTable[],MATCH(Simulator!$E56,MasterTable[P/N],0),COLUMN(MasterTable[F^2]))","v":-3.1828400000000002E-5},{"$f":"INDEX(MasterTable[],MATCH(Simulator!$E56,MasterTable[P/N],0),COLUMN(MasterTable[F]))","v":-1.1693700000000001E-3},{"$f":"INDEX(MasterTable[],MATCH(Simulator!$E56,MasterTable[P/N],0),COLUMN(MasterTable[F0]))","v":1.0407900000000001},{"$f":"IF(Simulator!$I$8=85,AE23,W53*M53^4+X53*M53^3+Y53*M53^2+Z53*M53+AA53)","v":1.0002149765625001},{"$f":"Simulator!$O$38/Q53","v":4.2485395645246943E-3},null,{"$f":"AC53/AB53","v":4.2476264243971927E-3},{"$f":"INDEX(MasterTable[],MATCH(Simulator!$E56,MasterTable[P/N],0),COLUMN(MasterTable[Typical Voltage]))","v":38},{"$f":"INDEX(MasterTable[],MATCH(Simulator!$E56,MasterTable[P/N],0),COLUMN(MasterTable[V^4]))","v":-5.0696360042000002E-14},{"$f":"INDEX(MasterTable[],MATCH(Simulator!$E56,MasterTable[P/N],0),COLUMN(MasterTable[V^3]))","v":5.0223240997000004E-10},{"$f":"INDEX(MasterTable[],MATCH(Simulator!$E56,MasterTable[P/N],0),COLUMN(MasterTable[V^2]))","v":-1.857052826E-6},{"$f":"INDEX(MasterTable[],MATCH(Simulator!$E56,MasterTable[P/N],0),COLUMN(MasterTable[V]))","v":4.6475978560999998E-3},{"$f":"INDEX(MasterTable[],MATCH(Simulator!$E56,MasterTable[P/N],0),COLUMN(MasterTable[V0]))","v":32.803258485999997},32.838461324960186,{"$f":"INDEX(MasterTable[],MATCH(Simulator!$E56,MasterTable[P/N],0),COLUMN(MasterTable[T^3]))","v":0},{"$f":"INDEX(MasterTable[],MATCH(Simulator!$E56,MasterTable[P/N],0),COLUMN(MasterTable[T^2]))","v":0},{"$f":"INDEX(MasterTable[],MATCH(Simulator!$E56,MasterTable[P/N],0),COLUMN(MasterTable[T]))","v":-0.02},{"$f":"INDEX(MasterTable[],MATCH(Simulator!$E56,MasterTable[P/N],0),COLUMN(MasterTable[T0]))","v":38.5},38,32.838461324960178,null,{"$f":"INDEX(MasterTable[],MATCH(Simulator!$E56,MasterTable[P/N],0),COLUMN(MasterTable['# of Die]))","v":156},{"$f":"AL53","v":32.838461324960186},{"$f":"INDEX(Tj_to_Vf6[],MATCH(Simulator!$I$8,Tj_to_Vf6[Vf],1),COLUMN(Tj_to_Vf6[Vf]))","v":-0.5},{"$f":"AU53+AV53*AT53","v":-45.161538675039814},{"$f":"IF(Simulator!$I$8=25,AQ53,AR53)","v":38}]
[]
["Calculations using Lumen Input",null,"Converting Tc to Tj",null,null,null,null,"Converting Tj to Tc",null,null,null,null,null,null,null,null,"Calculating Current",null,null,null,null,null,null,null,null,null,null,null,null,null,null,"Calculating Voltage w/ Tc",null,null,null,null,null,null,null,null,null,null,null,null,null,null,"Calculating Voltage w/ Tj"]
[null,null,"Tj = Tc + Power*Thermal Resistance",null,null,null,null,"Tc = Tj - Power*Thermal Resistance",null,null,null,null,null,null,null,null,"I=Fr@I*Eqn; Fr@I=Fro/Fr@T",null,null,null,null,null,null,null,null,null,null,null,null,null,null,"Vf@Tc&I = Vf@I + Vf@Tc-Vft",null,null,null,null,null,null,null,null,null,null,null,null,null,null,"Vf@Tj&I = Vf@I + Vf@Tj Modifier"]
[null,null,"Tc","Power","Thermal Resistance","Tc>>Tj",null,"Tj","Power","Thermal Resistance","Tj>>Tc",null,"Tc","Tj",{"$f":"IF(Simulator!$L$8=\"Case\",\"Tj\",\"Tc\")","v":"Tj"},null,"Ft","Fr@I Eqn",null,null,null,"Req'd I",null,"Fr@Tc Eqn",null,null,null,"Fr@Tc","Fro",null,"Fr@I","Vft",null,"Vf@I Eqn",null,null,null,"Vf@I","Vf@Tc Eqn",null,null,null,"Vf@Tc","Vf@Tc&I",null,"# of Die","Vf@I","Vf@Tj Modifier, per Die","Vf@Tj&I","Voltage Report"]
[null,"H6",{"$f":"IF(Simulator!$L$8=\"Case\",Simulator!$I$8,M58)","v":25},{"$f":"Simulator!G58*AR58/1000","v":{"$error":"#VALUE!"}},{"$f":"INDEX(MasterTable[],MATCH(Simulator!E58,MasterTable[P/N],0),COLUMN(MasterTable[Thermal Resistance]))","v":{"$error":"#N/A"}},{"$f":"C58+D58*E58","v":{"$error":"#VALUE!"}},null,{"$f":"IF(Simulator!$L$8=\"Case\",F58,Simulator!$I$8)","v":{"$error":"#VALUE!"}},{"$f":"Simulator!G58*AW58/1000","v":{"$error":"#VALUE!"}},{"$f":"E58","v":{"$error":"#N/A"}},{"$f":"H58-I58*J58","v":{"$error":"#VALUE!"}},null,{"$f":"IF(Simulator!$L$8=\"Case\",Simulator!$I$8,K58)","v":25},{"$f":"IF(Simulator!$L$8=\"Case\",H58,Simulator!$I$8)","v":{"$error":"#VALUE!"}},{"$f":"IF(#REF!=\"Tj\",N58,M58)","v":{"$error":"#REF!"}},null,{"$f":"INDEX(MasterTable[],MATCH(Simulator!E58,MasterTable[P/N],0),COLUMN(MasterTable[Typical Lumens]))","v":{"$error":"#N/A"}},null,{"$f":"INDEX(MasterTable[],MATCH(Simulator!$E58,MasterTable[P/N],0),COLUMN(MasterTable[I^2]))","v":{"$error":"#N/A"}},{"$f":"INDEX(MasterTable[],MATCH(Simulator!$E58,MasterTable[P/N],0),COLUMN(MasterTable[I]))","v":{"$error":"#N/A"}},{"$f":"INDEX(MasterTable[],MATCH(Simulator!$E58,MasterTable[P/N],0),COLUMN(MasterTable[I0]))","v":{"$error":"#N/A"}},{"$f":"(-T58+SQRT(T58^2-4*S58*(U58-AE58)))/(2*S58)","v":{"$error":"#N/A"}},{"$f":"INDEX(MasterTable[],MATCH(Simulator!$E58,MasterTable[P/N],0),COLUMN(MasterTable[F^4]))","v":{"$error":"#N/A"}},{"$f":"INDEX(MasterTable[],MATCH(Simulator!$E58,MasterTable[P/N],0),COLUMN(MasterTable[F^3]))","v":{"$error":"#N/A"}},{"$f":"INDEX(MasterTable[],MATCH(Simulator!$E58,MasterTable[P/N],0),COLUMN(MasterTable[F^2]))","v":{"$error":"#N/A"}},{"$f":"INDEX(MasterTable[],MATCH(Simulator!$E58,MasterTable[P/N],0),COLUMN(MasterTable[F]))","v":{"$error":"#N/A"}},{"$f":"INDEX(MasterTable[],MATCH(Simulator!$E58,MasterTable[P/N],0),COLUMN(MasterTable[F0]))","v":{"$error":"#N/A"}},{"$f":"IF(Simulator!$I$8=85,AE28,W58*M58^4+X58*M58^3+Y58*M58^2+Z58*M58+AA58)","v":{"$error":"#N/A"}},{"$f":"Simulator!$O$38/Q58","v":{"$error":"#N/A"}},null,{"$f":"AC58/AB58","v":{"$error":"#N/A"}},{"$f":"INDEX(MasterTable[],MATCH(Simulator!$E58,MasterTable[P/N],0),COLUMN(MasterTable[Typical Voltage]))","v":{"$error":"#N/A"}},{"$f":"INDEX(MasterTable[],MATCH(Simulator!$E58,MasterTable[P/N],0),COLUMN(MasterTable[V^4]))","v":{"$error":"#N/A"}},{"$f":"INDEX(MasterTable[],MATCH(Simulator!$E58,MasterTable[P/N],0),COLUMN(MasterTable[V^3]))","v":{"$error":"#N/A"}},{"$f":"INDEX(MasterTable[],MATCH(Simulator!$E58,MasterTable[P/N],0),COLUMN(MasterTable[V^2]))","v":{"$error":"#N/A"}},{"$f":"INDEX(MasterTable[],MATCH(Simulator!$E58,MasterTable[P/N],0),COLUMN(MasterTable[V]))","v":{"$error":"#N/A"}},{"$f":"INDEX(MasterTable[],MATCH(Simulator!$E58,MasterTable[P/N],0),COLUMN(MasterTable[V0]))","v":{"$error":"#N/A"}},{"$f":"AG58*V58^4+AH58*V58^3+AI58*V58^2+AJ58*V58+AK58","v":{"$error":"#N/A"}},{"$f":"INDEX(MasterTable[],MATCH(Simulator!$E58,MasterTable[P/N],0),COLUMN(MasterTable[T^3]))","v":{"$error":"#N/A"}},{"$f":"INDEX(MasterTable[],MATCH(Simulator!$E58,MasterTable[P/N],0),COLUMN(MasterTable[T^2]))","v":{"$error":"#N/A"}},{"$f":"INDEX(MasterTable[],MATCH(Simulator!$E58,MasterTable[P/N],0),COLUMN(MasterTable[T]))","v":{"$error":"#N/A"}},{"$f":"INDEX(MasterTable[],MATCH(Simulator!$E58,MasterTable[P/N],0),COLUMN(MasterTable[T0]))","v":{"$error":"#N/A"}},{"$f":"AM58*M58^3+AN58*M58^2+AO58*M58+AP58","v":{"$error":"#N/A"}},{"$f":"AL58+AQ58-AF58","v":{"$error":"#N/A"}},null,{"$f":"INDEX(MasterTable[],MATCH(Simulator!$E58,MasterTable[P/N],0),COLUMN(MasterTable['# of Die]))","v":{"$error":"#N/A"}},{"$f":"AL58","v":{"$error":"#N/A"}},{"$f":"INDEX(Tj_to_Vf6[],MATCH(Simulator!$I$8,Tj_to_Vf6[Vf],1),COLUMN(Tj_to_Vf6[Vf]))","v":-0.5},{"$f":"AU58+AV58*AT58","v":{"$error":"#N/A"}},{"$f":"IF(Simulator!$I$8=25,AQ58,AR58)","v":{"$error":"#N/A"}}]
[null,"H9",{"$f":"IF(Simulator!$L$8=\"Case\",Simulator!$I$8,M59)","v":25},{"$f":"Simulator!G59*AR59/1000","v":{"$error":"#VALUE!"}},{"$f":"INDEX(MasterTable[],MATCH(Simulator!E59,MasterTable[P/N],0),COLUMN(MasterTable[Thermal Resistance]))","v":{"$error":"#N/A"}},{"$error":"#VALUE!"},null,{"$f":"IF(Simulator!$L$8=\"Case\",F59,Simulator!$I$8)","v":{"$error":"#VALUE!"}},{"$f":"Simulator!G59*AW59/1000","v":{"$error":"#VALUE!"}},{"$error":"#N/A"},{"$error":"#VALUE!"},null,{"$f":"IF(Simulator!$L$8=\"Case\",Simulator!$I$8,K59)","v":25},{"$f":"IF(Simulator!$L$8=\"Case\",H59,Simulator!$I$8)","v":{"$error":"#VALUE!"}},{"$f":"IF(#REF!=\"Tj\",N59,M59)","v":{"$error":"#REF!"}},null,{"$f":"INDEX(MasterTable[],MATCH(Simulator!E59,MasterTable[P/N],0),COLUMN(MasterTable[Typical Lumens]))","v":{"$error":"#N/A"}},null,{"$f":"INDEX(MasterTable[],MATCH(Simulator!$E59,MasterTable[P/N],0),COLUMN(MasterTable[I^2]))","v":{"$error":"#N/A"}},{"$f":"INDEX(MasterTable[],MATCH(Simulator!$E59,MasterTable[P/N],0),COLUMN(MasterTable[I]))","v":{"$error":"#N/A"}},{"$f":"INDEX(MasterTable[],MATCH(Simulator!$E59,MasterTable[P/N],0),COLUMN(MasterTable[I0]))","v":{"$error":"#N/A"}},{"$f":"(-T59+SQRT(T59^2-4*S59*(U59-AE59)))/(2*S59)","v":{"$error":"#N/A"}},{"$f":"INDEX(MasterTable[],MATCH(Simulator!$E59,MasterTable[P/N],0),COLUMN(MasterTable[F^4]))","v":{"$error":"#N/A"}},{"$f":"INDEX(MasterTable[],MATCH(Simulator!$E59,MasterTable[P/N],0),COLUMN(MasterTable[F^3]))","v":{"$error":"#N/A"}},{"$f":"INDEX(MasterTable[],MATCH(Simulator!$E59,MasterTable[P/N],0),COLUMN(MasterTable[F^2]))","v":{"$error":"#N/A"}},{"$f":"INDEX(MasterTable[],MATCH(Simulator!$E59,MasterTable[P/N],0),COLUMN(MasterTable[F]))","v":{"$error":"#N/A"}},{"$f":"INDEX(MasterTable[],MATCH(Simulator!$E59,MasterTable[P/N],0),COLUMN(MasterTable[F0]))","v":{"$error":"#N/A"}},{"$f":"IF(Simulator!$I$8=85,AE29,W59*M59^4+X59*M59^3+Y59*M59^2+Z59*M59+AA59)","v":{"$error":"#N/A"}},{"$f":"Simulator!$O$38/Q59","v":{"$error":"#N/A"}},null,{"$f":"AC59/AB59","v":{"$error":"#N/A"}},{"$f":"INDEX(MasterTable[],MATCH(Simulator!$E59,MasterTable[P/N],0),COLUMN(MasterTable[Typical Voltage]))","v":{"$error":"#N/A"}},{"$f":"INDEX(MasterTable[],MATCH(Simulator!$E59,MasterTable[P/N],0),COLUMN(MasterTable[V^4]))","v":{"$error":"#N/A"}},{"$f":"INDEX(MasterTable[],MATCH(Simulator!$E59,MasterTable[P/N],0),COLUMN(MasterTable[V^3]))","v":{"$error":"#N/A"}},{"$f":"INDEX(MasterTable[],MATCH(Simulator!$E59,MasterTable[P/N],0),COLUMN(MasterTable[V^2]))","v":{"$error":"#N/A"}},{"$f":"INDEX(MasterTable[],MATCH(Simulator!$E59,MasterTable[P/N],0),COLUMN(MasterTable[V]))","v":{"$error":"#N/A"}},{"$f":"INDEX(MasterTable[],MATCH(Simulator!$E59,MasterTable[P/N],0),COLUMN(MasterTable[V0]))","v":{"$error":"#N/A"}},{"$f":"AG59*V59^4+AH59*V59^3+AI59*V59^2+AJ59*V59+AK59","v":{"$error":"#N/A"}},{"$f":"INDEX(MasterTable[],MATCH(Simulator!$E59,MasterTable[P/N],0),COLUMN(MasterTable[T^3]))","v":{"$error":"#N/A"}},{"$f":"INDEX(MasterTable[],MATCH(Simulator!$E59,MasterTable[P/N],0),COLUMN(MasterTable[T^2]))","v":{"$error":"#N/A"}},{"$f":"INDEX(MasterTable[],MATCH(Simulator!$E59,MasterTable[P/N],0),COLUMN(MasterTable[T]))","v":{"$error":"#N/A"}},{"$f":"INDEX(MasterTable[],MATCH(Simulator!$E59,MasterTable[P/N],0),COLUMN(MasterTable[T0]))","v":{"$error":"#N/A"}},{"$f":"AM59*M59^3+AN59*M59^2+AO59*M59+AP59","v":{"$error":"#N/A"}},{"$f":"AL59+AQ59-AF59","v":{"$error":"#N/A"}},null,{"$f":"INDEX(MasterTable[],MATCH(Simulator!$E59,MasterTable[P/N],0),COLUMN(MasterTable['# of Die]))","v":{"$error":"#N/A"}},{"$error":"#N/A"},{"$f":"INDEX(Tj_to_Vf6[],MATCH(Simulator!$I$8,Tj_to_Vf6[Vf],1),COLUMN(Tj_to_Vf6[Vf]))","v":-0.5},{"$error":"#N/A"},{"$f":"IF(Simulator!$I$8=25,AQ59,AR59)","v":{"$error":"#N/A"}}]
[null,"H12",{"$f":"IF(Simulator!$L$8=\"Case\",Simulator!$I$8,M60)","v":25},{"$f":"Simulator!G60*AR60/1000","v":{"$error":"#VALUE!"}},{"$f":"INDEX(MasterTable[],MATCH(Simulator!E60,MasterTable[P/N],0),COLUMN(MasterTable[Thermal Resistance]))","v":{"$error":"#N/A"}},{"$error":"#VALUE!"},null,{"$f":"IF(Simulator!$L$8=\"Case\",F60,Simulator!$I$8)","v":{"$error":"#VALUE!"}},{"$f":"Simulator!G60*AW60/1000","v":{"$error":"#VALUE!"}},{"$error":"#N/A"},{"$error":"#VALUE!"},null,{"$f":"IF(Simulator!$L$8=\"Case\",Simulator!$I$8,K60)","v":25},{"$f":"IF(Simulator!$L$8=\"Case\",H60,Simulator!$I$8)","v":{"$error":"#VALUE!"}},{"$f":"IF(#REF!=\"Tj\",N60,M60)","v":{"$error":"#REF!"}},null,{"$f":"INDEX(MasterTable[],MATCH(Simulator!E60,MasterTable[P/N],0),COLUMN(MasterTable[Typical Lumens]))","v":{"$error":"#N/A"}},null,{"$f":"INDEX(MasterTable[],MATCH(Simulator!$E60,MasterTable[P/N],0),COLUMN(MasterTable[I^2]))","v":{"$error":"#N/A"}},{"$f":"INDEX(MasterTable[],MATCH(Simulator!$E60,MasterTable[P/N],0),COLUMN(MasterTable[I]))","v":{"$error":"#N/A"}},{"$f":"INDEX(MasterTable[],MATCH(Simulator!$E60,MasterTable[P/N],0),COLUMN(MasterTable[I0]))","v":{"$error":"#N/A"}},{"$error":"#N/A"},{"$f":"INDEX(MasterTable[],MATCH(Simulator!$E60,MasterTable[P/N],0),COLUMN(MasterTable[F^4]))","v":{"$error":"#N/A"}},{"$f":"INDEX(MasterTable[],MATCH(Simulator!$E60,MasterTable[P/N],0),COLUMN(MasterTable[F^3]))","v":{"$error":"#N/A"}},{"$f":"INDEX(MasterTable[],MATCH(Simulator!$E60,MasterTable[P/N],0),COLUMN(MasterTable[F^2]))","v":{"$error":"#N/A"}},{"$f":"INDEX(MasterTable[],MATCH(Simulator!$E60,MasterTable[P/N],0),COLUMN(MasterTable[F]))","v":{"$error":"#N/A"}},{"$f":"INDEX(MasterTable[],MATCH(Simulator!$E60,MasterTable[P/N],0),COLUMN(MasterTable[F0]))","v":{"$error":"#N/A"}},{"$f":"IF(Simulator!$I$8=85,AE30,W60*M60^4+X60*M60^3+Y60*M60^2+Z60*M60+AA60)","v":{"$error":"#N/A"}},{"$f":"Simulator!$O$38/Q60","v":{"$error":"#N/A"}},null,{"$error":"#N/A"},{"$f":"INDEX(MasterTable[],MATCH(Simulator!$E60,MasterTable[P/N],0),COLUMN(MasterTable[Typical Voltage]))","v":{"$error":"#N/A"}},{"$f":"INDEX(MasterTable[],MATCH(Simulator!$E60,MasterTable[P/N],0),COLUMN(MasterTable[V^4]))","v":{"$error":"#N/A"}},{"$f":"INDEX(MasterTable[],MATCH(Simulator!$E60,MasterTable[P/N],0),COLUMN(MasterTable[V^3]))","v":{"$error":"#N/A"}},{"$f":"INDEX(MasterTable[],MATCH(Simulator!$E60,MasterTable[P/N],0),COLUMN(MasterTable[V^2]))","v":{"$error":"#N/A"}},{"$f":"INDEX(MasterTable[],MATCH(Simulator!$E60,MasterTable[P/N],0),COLUMN(MasterTable[V]))","v":{"$error":"#N/A"}},{"$f":"INDEX(MasterTable[],MATCH(Simulator!$E60,MasterTable[P/N],0),COLUMN(MasterTable[V0]))","v":{"$error":"#N/A"}},{"$error":"#N/A"},{"$f":"INDEX(MasterTable[],MATCH(Simulator!$E60,MasterTable[P/N],0),COLUMN(MasterTable[T^3]))","v":{"$error":"#N/A"}},{"$f":"INDEX(MasterTable[],MATCH(Simulator!$E60,MasterTable[P/N],0),COLUMN(MasterTable[T^2]))","v":{"$error":"#N/A"}},{"$f":"INDEX(MasterTable[],MATCH(Simulator!$E60,MasterTable[P/N],0),COLUMN(MasterTable[T]))","v":{"$error":"#N/A"}},{"$f":"INDEX(MasterTable[],MATCH(Simulator!$E60,MasterTable[P/N],0),COLUMN(MasterTable[T0]))","v":{"$error":"#N/A"}},{"$error":"#N/A"},{"$error":"#N/A"},null,{"$f":"INDEX(MasterTable[],MATCH(Simulator!$E60,MasterTable[P/N],0),COLUMN(MasterTable['# of Die]))","v":{"$error":"#N/A"}},{"$error":"#N/A"},{"$f":"INDEX(Tj_to_Vf6[],MATCH(Simulator!$I$8,Tj_to_Vf6[Vf],1),COLUMN(Tj_to_Vf6[Vf]))","v":-0.5},{"$error":"#N/A"},{"$f":"IF(Simulator!$I$8=25,AQ60,AR60)","v":{"$error":"#N/A"}}]
[null,"H15",{"$f":"IF(Simulator!$L$8=\"Case\",Simulator!$I$8,M61)","v":25},{"$f":"Simulator!G61*AR61/1000","v":{"$error":"#VALUE!"}},{"$f":"INDEX(MasterTable[],MATCH(Simulator!E61,MasterTable[P/N],0),COLUMN(MasterTable[Thermal Resistance]))","v":{"$error":"#N/A"}},{"$error":"#VALUE!"},null,{"$f":"IF(Simulator!$L$8=\"Case\",F61,Simulator!$I$8)","v":{"$error":"#VALUE!"}},{"$f":"Simulator!G61*AW61/1000","v":{"$error":"#VALUE!"}},{"$error":"#N/A"},{"$error":"#VALUE!"},null,{"$f":"IF(Simulator!$L$8=\"Case\",Simulator!$I$8,K61)","v":25},{"$f":"IF(Simulator!$L$8=\"Case\",H61,Simulator!$I$8)","v":{"$error":"#VALUE!"}},{"$f":"IF(#REF!=\"Tj\",N61,M61)","v":{"$error":"#REF!"}},null,{"$f":"INDEX(MasterTable[],MATCH(Simulator!E61,MasterTable[P/N],0),COLUMN(MasterTable[Typical Lumens]))","v":{"$error":"#N/A"}},null,{"$f":"INDEX(MasterTable[],MATCH(Simulator!$E61,MasterTable[P/N],0),COLUMN(MasterTable[I^2]))","v":{"$error":"#N/A"}},{"$f":"INDEX(MasterTable[],MATCH(Simulator!$E61,MasterTable[P/N],0),COLUMN(MasterTable[I]))","v":{"$error":"#N/A"}},{"$f":"INDEX(MasterTable[],MATCH(Simulator!$E61,MasterTable[P/N],0),COLUMN(MasterTable[I0]))","v":{"$error":"#N/A"}},{"$error":"#N/A"},{"$f":"INDEX(MasterTable[],MATCH(Simulator!$E61,MasterTable[P/N],0),COLUMN(MasterTable[F^4]))","v":{"$error":"#N/A"}},{"$f":"INDEX(MasterTable[],MATCH(Simulator!$E61,MasterTable[P/N],0),COLUMN(MasterTable[F^3]))","v":{"$error":"#N/A"}},{"$f":"INDEX(MasterTable[],MATCH(Simulator!$E61,MasterTable[P/N],0),COLUMN(MasterTable[F^2]))","v":{"$error":"#N/A"}},{"$f":"INDEX(MasterTable[],MATCH(Simulator!$E61,MasterTable[P/N],0),COLUMN(MasterTable[F]))","v":{"$error":"#N/A"}},{"$f":"INDEX(MasterTable[],MATCH(Simulator!$E61,MasterTable[P/N],0),COLUMN(MasterTable[F0]))","v":{"$error":"#N/A"}},{"$f":"IF(Simulator!$I$8=85,AE31,W61*M61^4+X61*M61^3+Y61*M61^2+Z61*M61+AA61)","v":{"$error":"#N/A"}},{"$f":"Simulator!$O$38/Q61","v":{"$error":"#N/A"}},null,{"$error":"#N/A"},{"$f":"INDEX(MasterTable[],MATCH(Simulator!$E61,MasterTable[P/N],0),COLUMN(MasterTable[Typical Voltage]))","v":{"$error":"#N/A"}},{"$f":"INDEX(MasterTable[],MATCH(Simulator!$E61,MasterTable[P/N],0),COLUMN(MasterTable[V^4]))","v":{"$error":"#N/A"}},{"$f":"INDEX(MasterTable[],MATCH(Simulator!$E61,MasterTable[P/N],0),COLUMN(MasterTable[V^3]))","v":{"$error":"#N/A"}},{"$f":"INDEX(MasterTable[],MATCH(Simulator!$E61,MasterTable[P/N],0),COLUMN(MasterTable[V^2]))","v":{"$error":"#N/A"}},{"$f":"INDEX(MasterTable[],MATCH(Simulator!$E61,MasterTable[P/N],0),COLUMN(MasterTable[V]))","v":{"$error":"#N/A"}},{"$f":"INDEX(MasterTable[],MATCH(Simulator!$E61,MasterTable[P/N],0),COLUMN(MasterTable[V0]))","v":{"$error":"#N/A"}},{"$error":"#N/A"},{"$f":"INDEX(MasterTable[],MATCH(Simulator!$E61,MasterTable[P/N],0),COLUMN(MasterTable[T^3]))","v":{"$error":"#N/A"}},{"$f":"INDEX(MasterTable[],MATCH(Simulator!$E61,MasterTable[P/N],0),COLUMN(MasterTable[T^2]))","v":{"$error":"#N/A"}},{"$f":"INDEX(MasterTable[],MATCH(Simulator!$E61,MasterTable[P/N],0),COLUMN(MasterTable[T]))","v":{"$error":"#N/A"}},{"$f":"INDEX(MasterTable[],MATCH(Simulator!$E61,MasterTable[P/N],0),COLUMN(MasterTable[T0]))","v":{"$error":"#N/A"}},{"$error":"#N/A"},{"$error":"#N/A"},null,{"$f":"INDEX(MasterTable[],MATCH(Simulator!$E61,MasterTable[P/N],0),COLUMN(MasterTable['# of Die]))","v":{"$error":"#N/A"}},{"$error":"#N/A"},{"$f":"INDEX(Tj_to_Vf6[],MATCH(Simulator!$I$8,Tj_to_Vf6[Vf],1),COLUMN(Tj_to_Vf6[Vf]))","v":-0.5},{"$error":"#N/A"},{"$f":"IF(Simulator!$I$8=25,AQ61,AR61)","v":{"$error":"#N/A"}}]
[]
[null,null,null,null,null,null,null,null,null,null,null,null,null,null,null,null,null,"REV TABLE"]
[null,null,null,null,null,null,null,null,null,null,null,null,null,null,null,null,null,"Bridgelux Product Simulator EXPIRES 06-30-15 Rev 1.0.","Rev 1.0.1","Added efficacy graphic to Section 2, updated Vero 10 data"]
[null,null,null,null,null,null,null,null,null,null,null,null,null,null,null,null,null,"Bridgelux Product Simulator EXPIRES 06-30-15 Rev 1.01","Rev 1.01","Updated V6 data to 130 lm/W performance data",null,null,null,null,null,null,null,null,null,null,null,null,null,null,null,null,null,null,null,null,null,null,{"$f":"AF20+((M20-25)*-11)/1000","v":26.5}]
[null,null,null,null,null,null,null,null,null,null,null,null,null,null,null,null,null,"Bridgelux Product Simulator EXPIRES 06-30-15 Rev 1.01","Rev 1.01.1","Updated Vero 10 typical lumens value, adjusted flux vs. current equation calculation to be 1 if Tc = 25C for Vero/V 18 and Vero 29"]
[null,null,null,null,null,null,null,null,null,null,null,null,null,null,null,null,null,"Bridgelux Product Simulator EXPIRES 09-30-15 Rev 2.01","Rev 2.01","Added 35E and 35G for all form factors, updated flux vs. temperature equations for Vero 13, 18 & 29 to remove unenven bump",null,null,null,null,null,null,null,null,null,null,null,null,"y = -0.00000000000004773529x4 + 0.00000000039481665238x3 - 0.00000137893876986040x2 + 0.00478211933972296000x + 30.96295733186940000000"]
[null,null,null,null,null,null,null,null,null,null,null,null,null,null,null,null,null,"Bridgelux Product Simulator EXPIRES 09-30-15 Rev 2.02","Rev 2.02","Added 35A SKU's, added data validation to Tc input to limit Tc input to a range of 0-105C."]
[null,null,null,null,null,null,null,null,null,null,null,null,null,null,null,null,null,"Bridgelux Product Simulator EXPIRES 09-30-15 Rev 2.03","Rev 2.03","fixed V18 max current error that was causing an error for V18 50C parts"]
[null,null,null,null,null,null,null,null,null,null,null,null,null,null,null,null,null,"Bridgelux Product Simulator EXPIRES 09-30-15 Rev 2.04","Rev 2.04","Updated Vero and V Series Specs "]
[null,null,null,null,null,null,null,null,null,null,null,null,null,null,null,null,null,"Bridgelux Product Simulator EXPIRES 09-30-15 Rev 2.05","Rev 2.05","Updated with V22 Specs"]
[null,null,null,null,null,null,null,null,null,null,null,null,null,null,null,null,null,"Bridgelux Product Simulator EXPIRES 09-30-15 Rev 2.06","Rev 2.06","Updated with H6 & H9"]
[null,null,null,null,null,null,null,null,null,null,null,null,null,null,null,null,null,"Bridgelux Product Simulator EXPIRES 07-01-16 Rev 2.07","Rev 2.07","Updated with H6, H9, H12 and H15. Corected Tj calculations."]

{"sheet":"Data","index":3,"n_rows":254,"n_cols":43,"rows_kept":254,"cut":false,"hidden":true,"merged":[[69,14,69,16],[70,14,70,16],[70,31,70,33],[70,28,70,30],[70,22,70,25],[70,18,70,21]]}
["Thermal Resistance at max drive current",null,null,null,null,null,null,null,null,null,null,1,null,null,2,3,4,5,null,6,7,8,null,null,null,null,null,null,10,11,12,13,14,15,16,17,19,20,21,22,23,24,25]
["Form Factor","Max Current","Rth",null,null,null,"CCT/ CRI PN Creator"]
["Vero 10",700,1.49,null,null,null,"CCT/CRI","Code"]
["Vero 13",1050,0.87,null,null,null,"1750K, 80 CRI Décor","17E"]
["Vero 18",2100,0.55000000000000004,null,null,null,"2500K, 80 CRI Décor","25E"]
["Vero 29",3150,0.26,null,null,null,"2700K, 80 CRI","27E"]
["BXRA3-Star-AF",500,2.6,null,null,null,"2700K, 90 CRI","27G"]
["BXRA3-Star-AI",500,1.75,null,null,null,"2700K, 97 CRI Décor","27H"]
["BXRA3-Rect-BG",1000,0.95,null,null,null,"3000K, Class A Décor","30A"]
["BXRA3-Rect-BJ",1000,0.8,null,null,null,"3000K, 80 CRI","30E"]
["BXRA3-Rect-BL",1000,0.65,null,null,null,"3000K 90 CRI","30G"]
["BXRA3-Mega-FF",2250,0.46,null,null,null,"3000K, 97 CRI Décor","30H"]
["BXRA3-Mega-HH",3000,0.31,null,null,null,"3500K, Class A Décor","35A"]
["BXRA3-Mega-JJ",3750,0.26,null,null,null,"3500K, 80 CRI","35E"]
["V Series V15",2000,0.4,null,null,null,"3500K, 90 CRI","35G"]
["V Series V6",null,1.5,null,null,null,"4000K, Class A Décor","40A"]
["H Series H9",2450,2450,null,null,null,"4000K, 80 CRI","40E"]
[null,null,null,null,null,null,"4000K, 90 CRI","40G"]
["Tj","Vf",null,null,null,null,"5000K, 70 CRI","50C"]
[-40,0.26,null,null,null,null,"5000K, 80 CRI","50E"]
[-35,0.24,null,null,null,null,"5000K, 90 CRI","50G"]
[-30,0.22,null,null,null,null,"5600K, 90 CRI Décor","56G"]
[-25,0.19999999999999998,null,null,null,null,"Vero 10",null,null,"Vero 13","Data from 130 LPW Mass Production and Engineering Recommended DS Value_01042015_V2",null,"Vero 18","Data from 130 LPW Mass Production and Engineering Recommended DS Value_01042015_V2",null,"Vero 29","Data from 130 LPW Mass Production and Engineering Recommended DS Value_01042015_V2"]
[-20,0.18000000000000002,null,null,null,null,"Code","85 DC Factor",null,"Code","85 DC Factor",null,"Code","85 DC Factor",null,"Code","85 DC Factor"]
[-15,0.16,null,null,null,null,"17E","-",null,"17E","-",null,"17E",0.88,null,"17E",0.88]
[-10,0.13999999999999999,null,null,null,null,"25E","-",null,"25E","-",null,"25E",0.88,null,"25E",0.88]
[-5,0.12,null,null,null,null,"27E",0.88898999999999995,null,"27E",0.91579999999999995,null,"27E",0.90691252449670401,null,"27E",0.90539926611916821]
[0,9.9999999999999992E-2,null,null,null,null,"27G",0.88898999999999995,null,"27G",0.88,null,"27G",0.88,null,"27G",0.88]
[5,0.08,null,null,null,null,"27H",0.82,null,"27H",0.82,null,"27H",0.82,null,"27H",0.82]
[10,0.06,null,null,null,null,"30A",0.88812461440000001,null,"30A",0.88812461440000001,null,"30A",0.87769747119999997,null,"30A",0.89107579370000001]
[15,0.04,null,null,null,null,"30E",0.88932599999999995,null,"30E",0.90076212096643438,null,"30E",0.90421201296003983,null,"30E",0.90774086378737495]
[20,0.02,null,null,null,null,"30G",0.88932599999999995,null,"30G",0.88,null,"30G",0.88,null,"30G",0.88]
[25,0,null,null,null,null,"30H",0.82,null,"30H",0.82,null,"30H",0.82,null,"30H",0.82]
[30,-0.02,null,null,null,null,"35E",0.88932599999999995,null,"35E",0.90566335384129992,null,"35E",0.90843612881861069,null,"35E",0.89750486066105006]
[35,-0.04,null,null,null,null,"35G",0.89,null,"35G",0.89,null,"35G",0.89,null,"35G",0.89]
[40,-0.06,null,null,null,null,"35H","-",null,"35H","-",null,"35H",null,null,"35H"]
[45,-0.08,null,null,null,null,"40A",0.88787044189999997,null,"40A",0.88787044189999997,null,"40A",0.89355050089999999,null,"40A",0.8906497457]
[50,-9.9999999999999992E-2,null,null,null,null,"40E",0.88565000000000005,null,"40E",0.9019637925744094,null,"40E",0.90312681429874753,null,"40E",0.89817667400188606]
[55,-0.12,null,null,null,null,"40G",0.88565000000000005,null,"40G",0.88,null,"40G",0.88,null,"40G",0.88]
[60,-0.13999999999999999,null,null,null,null,"50C",0.87918499999999999,null,"50C",0.88,null,"50C",0.88,null,"50C",0.88]
[65,-0.16,null,null,null,null,"50E",0.87918499999999999,null,"50E",0.88,null,"50E",0.88,null,"50E",0.88]
[70,-0.18000000000000002,null,null,null,null,"50G",0.87918499999999999,null,"50G",0.88,null,"50G",0.88,null,"50G",0.88]
[75,-0.19999999999999998,null,null,null,null,"56G",0.86,null,"56G",0.86,null,"56G",0.88,null,"56G",0.88]
[80,-0.22]
[85,-0.24]
[90,-0.26,null,null,null,null,"V6","Vseries Mass Production and Engineering Recommended DS Value Current DS Comparison 11-18-14",null,"V8","Data from 130 LPW Mass Production and Engineering Recommended DS Value_01042015_V2",null,"V10","Data from: DS42 V Series V10 130lm-W Data Sheet Tables",null,"V15","Data from: DS43 V Series V15 130lm-W Data Sheet Tables",null,null,null,"V22","Data from: DS43 V Series V15 130lm-W Data Sheet Tables"]
[95,-0.27999999999999997,null,null,null,null,"Code","85 DC Factor",null,"Code","85 DC Factor",null,"Code","85 DC Factor",null,"Code","85 DC Factor",null,null,null,"Code","85 DC Factor"]
[100,-0.3,null,null,null,null,"27E",0.9,null,"27E",0.89800000000000002,null,"27E",0.88873228900000001,null,"27E",0.892060046,null,null,null,"27E",0.89991578660000004]
[105,-0.32,null,null,null,null,"27G",0.9,null,"27G",0.88,null,"27G",0.88873228900000001,null,"27G",0.892060046,null,null,null,"30E",0.89831908820000006]
[110,-0.34,null,null,null,null,"30E",0.9,null,"30E",0.89600000000000002,null,"30E",0.89565275099999997,null,"30E",0.89370903300000004,null,null,null,"40E",0.89016532060000009]
[115,-0.36000000000000004,null,null,null,null,"30G",0.9,null,"30G",0.88,null,"30G",0.89565275099999997,null,"30G",0.89370903300000004,null,null,null,"50C",0.88338153930000007]
[120,-0.38000000000000006,null,null,null,null,"40E",0.9,null,"40E",0.90100000000000002,null,"40E",0.896027095,null,"40E",0.89357501399999995]
[125,-0.39999999999999997,null,null,null,null,"40G",null,null,"40G",0.88,null,"40G",0.896027095,null,"40G",0.89357501399999995]
[130,-0.42,null,null,null,null,"50C",0.9,null,"50C",0.88,null,"50C",0.86730394499999997,null,"50C",0.86730394499999997]
[135,-0.44,null,null,null,null,"50E",0.9,null,"50E",0.88,null,"50E",0.86730394499999997,null,"50E",0.86730394499999997]
[140,-0.46,null,null,null,null,"50G",0.9,null,"50G",0.88,null,"50G",0.86730394499999997,null,"50G",0.86730394499999997]
[145,-0.48]
[150,-0.5]
[null,null,null,null,null,null,"H6",null,null,"H9",null,null,"H12",null,null,"H15"]
[null,null,null,null,null,null,"Code","85 DC Factor",null,"Code","85 DC Factor",null,"Code","85 DC Factor",null,"Code","85 DC Factor"]
[null,null,null,null,null,null,"27E",0.8786931818181819,null,"27E",0.87,null,"27E",0.85212765957446801,null,"27E",0.85212765957446801]
[null,null,null,null,null,null,"30E",0.88062568605927549,null,"30E",0.88,null,"30E",0.86878556238864302,null,"30E",0.86878556238864302]
[null,null,null,null,null,null,"30G",0.8859720251368336,null,"30G",0.86,null,"30G",0.84522361359570675,null,"30G",0.84522361359570675]
[null,null,null,null,null,null,"35A",0.87376805724314843,null,"35A",0.89,null,"35A",0.86511329628046174,null,"35A",0.86511329628046174]
[null,null,null,null,null,null,"40E",0.87162790697674419,null,"40E",0.87,null,"40E",0.85819006433920464,null,"40E",0.85819006433920464]
[]
[]
[null,null,null,null,null,null,null,null,null,"y = -0.00000000000004773529x4 + 0.00000000039481665238x3 - 0.00000137893876986040x2 + 0.00478211933972296000x + 30.96295733186940000000",null,null,null,null,null,null,null,null,2.7328800000000002E-9,-4.7516499999999996E-6,6.4620399999999996E-3,-4.7532999999999999E-4,null,null,null,null,null,null,"0.02x + 36.4"]
[]
["Master Table"]
[null,null,null,null,null,null,null,null,null,null,null,null,null,null,"Voltage",null,null,null,"Current vs Relative Flux",null,null,null,"Current vs Relative Flux @ 85DC",null,null,null,null,null,"Flux vs Temperature",null,null,"Voltage vs Temperature"]
["Product Family","CCT/CRI","Arrangement","Lumen Family","Generation","PF+CR","P/N","Typical Lumens","Thermal Resistance","Typical Voltage","Typical Current","Max Current","# of Die","V^4","V^3","V^2","V","V0","I^3","I^2","I","I0","I^32","I^23","I4","I05","F^4","F^3","F^2","F","F0","T^3","T^2","T","T0"]
["V6-AF","27E","A",400,"BXRE",{"$f":"MasterTable[[#This Row],[Product Family]]&\"-\"&MasterTable[[#This Row],[CCT/CRI]]","v":"V6-AF-27E"},{"$f":"MasterTable[[#This Row],[Generation]]&\"-\"&MasterTable[[#This Row],[CCT/CRI]]&IF(MasterTable[[#This Row],[Lumen Family]]<999,\"0\"&MasterTable[[#This Row],[Lumen Family]],MasterTable[[#This Row],[Lumen Family]])&\"-\"&MasterTable[[#This Row],[Arrangement]]&\"-2x\"","v":"BXRE-27E0400-A-2x"},374,1.25,18,175,350,6,-2.72766E-10,2.4862200000000001E-7,-8.5545700000000003E-5,2.1716599999999999E-2,15.540900000000001,2.97857E-9,-4.8457799999999997E-6,6.4789100000000001E-3,1.5946800000000001E-4,null,null,null,null,null,null,-6.8073E-6,-1.16E-3,1.0318087339999999,null,null,-7.0000000000000001E-3,17.975000000000001]
["V6-AF","27G","A",400,"BXRE",{"$f":"MasterTable[[#This Row],[Product Family]]&\"-\"&MasterTable[[#This Row],[CCT/CRI]]","v":"V6-AF-27G"},{"$f":"MasterTable[[#This Row],[Generation]]&\"-\"&MasterTable[[#This Row],[CCT/CRI]]&IF(MasterTable[[#This Row],[Lumen Family]]<999,\"0\"&MasterTable[[#This Row],[Lumen Family]],MasterTable[[#This Row],[Lumen Family]])&\"-\"&MasterTable[[#This Row],[Arrangement]]&\"-2x\"","v":"BXRE-27G0400-A-2x"},318,1.25,18,175,350,6,-2.72766E-10,2.4862200000000001E-7,-8.5545700000000003E-5,2.1716599999999999E-2,15.540900000000001,2.97857E-9,-4.8457799999999997E-6,6.4789100000000001E-3,1.5946800000000001E-4,null,null,null,null,null,null,-6.8073E-6,-1.16E-3,1.0318087339999999,null,null,-7.0000000000000001E-3,17.975000000000001]
["V6-AF","30E","A",400,"BXRE",{"$f":"MasterTable[[#This Row],[Product Family]]&\"-\"&MasterTable[[#This Row],[CCT/CRI]]","v":"V6-AF-30E"},{"$f":"MasterTable[[#This Row],[Generation]]&\"-\"&MasterTable[[#This Row],[CCT/CRI]]&IF(MasterTable[[#This Row],[Lumen Family]]<999,\"0\"&MasterTable[[#This Row],[Lumen Family]],MasterTable[[#This Row],[Lumen Family]])&\"-\"&MasterTable[[#This Row],[Arrangement]]&\"-2x\"","v":"BXRE-30E0400-A-2x"},393,1.25,18,175,350,6,-2.72766E-10,2.4862200000000001E-7,-8.5545700000000003E-5,2.1716599999999999E-2,15.540900000000001,2.97857E-9,-4.8457799999999997E-6,6.4789100000000001E-3,1.5946800000000001E-4,null,null,null,null,null,null,-6.8073E-6,-1.16E-3,1.0318087339999999,null,null,-7.0000000000000001E-3,17.975000000000001]
["V6-AF","30G","A",400,"BXRE",{"$f":"MasterTable[[#This Row],[Product Family]]&\"-\"&MasterTable[[#This Row],[CCT/CRI]]","v":"V6-AF-30G"},{"$f":"MasterTable[[#This Row],[Generation]]&\"-\"&MasterTable[[#This Row],[CCT/CRI]]&IF(MasterTable[[#This Row],[Lumen Family]]<999,\"0\"&MasterTable[[#This Row],[Lumen Family]],MasterTable[[#This Row],[Lumen Family]])&\"-\"&MasterTable[[#This Row],[Arrangement]]&\"-2x\"","v":"BXRE-30G0400-A-2x"},330,1.25,18,175,350,6,-2.72766E-10,2.4862200000000001E-7,-8.5545700000000003E-5,2.1716599999999999E-2,15.540900000000001,2.97857E-9,-4.8457799999999997E-6,6.4789100000000001E-3,1.5946800000000001E-4,null,null,null,null,null,null,-6.8073E-6,-1.16E-3,1.0318087339999999,null,null,-7.0000000000000001E-3,17.975000000000001]
["V6-AF","35E","A",400,"BXRE",{"$f":"MasterTable[[#This Row],[Product Family]]&\"-\"&MasterTable[[#This Row],[CCT/CRI]]","v":"V6-AF-35E"},{"$f":"MasterTable[[#This Row],[Generation]]&\"-\"&MasterTable[[#This Row],[CCT/CRI]]&IF(MasterTable[[#This Row],[Lumen Family]]<999,\"0\"&MasterTable[[#This Row],[Lumen Family]],MasterTable[[#This Row],[Lumen Family]])&\"-\"&MasterTable[[#This Row],[Arrangement]]&\"-2x\"","v":"BXRE-35E0400-A-2x"},403,1.25,18,175,350,6,-2.72766E-10,2.4862200000000001E-7,-8.5545700000000003E-5,2.1716599999999999E-2,15.540900000000001,2.97857E-9,-4.8457799999999997E-6,6.4789100000000001E-3,1.5946800000000001E-4,null,null,null,null,null,null,-6.8073E-6,-1.16E-3,1.0318087339999999,null,null,-7.0000000000000001E-3,17.975000000000001]
["V6-AF","35G","A",400,"BXRE",{"$f":"MasterTable[[#This Row],[Product Family]]&\"-\"&MasterTable[[#This Row],[CCT/CRI]]","v":"V6-AF-35G"},{"$f":"MasterTable[[#This Row],[Generation]]&\"-\"&MasterTable[[#This Row],[CCT/CRI]]&IF(MasterTable[[#This Row],[Lumen Family]]<999,\"0\"&MasterTable[[#This Row],[Lumen Family]],MasterTable[[#This Row],[Lumen Family]])&\"-\"&MasterTable[[#This Row],[Arrangement]]&\"-2x\"","v":"BXRE-35G0400-A-2x"},344,1.25,18,175,350,6,-2.72766E-10,2.4862200000000001E-7,-8.5545700000000003E-5,2.1716599999999999E-2,15.540900000000001,2.97857E-9,-4.8457799999999997E-6,6.4789100000000001E-3,1.5946800000000001E-4,null,null,null,null,null,null,-6.8073E-6,-1.16E-3,1.0318087339999999,null,null,-7.0000000000000001E-3,17.975000000000001]
["V6-AF","40E","A",400,"BXRE",{"$f":"MasterTable[[#This Row],[Product Family]]&\"-\"&MasterTable[[#This Row],[CCT/CRI]]","v":"V6-AF-40E"},{"$f":"MasterTable[[#This Row],[Generation]]&\"-\"&MasterTable[[#This Row],[CCT/CRI]]&IF(MasterTable[[#This Row],[Lumen Family]]<999,\"0\"&MasterTable[[#This Row],[Lumen Family]],MasterTable[[#This Row],[Lumen Family]])&\"-\"&MasterTable[[#This Row],[Arrangement]]&\"-2x\"","v":"BXRE-40E0400-A-2x"},409,1.25,18,175,350,6,-2.72766E-10,2.4862200000000001E-7,-8.5545700000000003E-5,2.1716599999999999E-2,15.540900000000001,2.97857E-9,-4.8457799999999997E-6,6.4789100000000001E-3,1.5946800000000001E-4,null,null,null,null,null,null,-6.1E-6,-1.1199999999999999E-3,1.031425,null,null,-7.0000000000000001E-3,17.975000000000001]
["V6-AF","50C","A",400,"BXRE",{"$f":"MasterTable[[#This Row],[Product Family]]&\"-\"&MasterTable[[#This Row],[CCT/CRI]]","v":"V6-AF-50C"},{"$f":"MasterTable[[#This Row],[Generation]]&\"-\"&MasterTable[[#This Row],[CCT/CRI]]&IF(MasterTable[[#This Row],[Lumen Family]]<999,\"0\"&MasterTable[[#This Row],[Lumen Family]],MasterTable[[#This Row],[Lumen Family]])&\"-\"&MasterTable[[#This Row],[Arrangement]]&\"-2x\"","v":"BXRE-50C0400-A-2x"},439,1.25,18,175,350,6,-2.72766E-10,2.4862200000000001E-7,-8.5545700000000003E-5,2.1716599999999999E-2,15.540900000000001,2.97857E-9,-4.8457799999999997E-6,6.4789100000000001E-3,1.5946800000000001E-4,null,null,null,null,null,null,-3.6500000000000002E-6,-1.81E-3,1.05,null,null,-7.0000000000000001E-3,17.975000000000001]
["V6-AF","50E","A",400,"BXRE",{"$f":"MasterTable[[#This Row],[Product Family]]&\"-\"&MasterTable[[#This Row],[CCT/CRI]]","v":"V6-AF-50E"},{"$f":"MasterTable[[#This Row],[Generation]]&\"-\"&MasterTable[[#This Row],[CCT/CRI]]&IF(MasterTable[[#This Row],[Lumen Family]]<999,\"0\"&MasterTable[[#This Row],[Lumen Family]],MasterTable[[#This Row],[Lumen Family]])&\"-\"&MasterTable[[#This Row],[Arrangement]]&\"-2x\"","v":"BXRE-50E0400-A-2x"},412,1.25,18,175,350,6,-2.72766E-10,2.4862200000000001E-7,-8.5545700000000003E-5,2.1716599999999999E-2,15.540900000000001,2.97857E-9,-4.8457799999999997E-6,6.4789100000000001E-3,1.5946800000000001E-4,null,null,null,null,null,null,-3.6500000000000002E-6,-1.81E-3,1.05,null,null,-7.0000000000000001E-3,17.975000000000001]
["V6-BC","27E","B",400,"BXRE",{"$f":"MasterTable[[#This Row],[Product Family]]&\"-\"&MasterTable[[#This Row],[CCT/CRI]]","v":"V6-BC-27E"},{"$f":"MasterTable[[#This Row],[Generation]]&\"-\"&MasterTable[[#This Row],[CCT/CRI]]&IF(MasterTable[[#This Row],[Lumen Family]]<999,\"0\"&MasterTable[[#This Row],[Lumen Family]],MasterTable[[#This Row],[Lumen Family]])&\"-\"&MasterTable[[#This Row],[Arrangement]]&\"-2x\"","v":"BXRE-27E0400-B-2x"},374,1.25,9,350,700,6,-9.3816900000000006E-12,1.6809100000000001E-8,-1.1390600000000001E-5,5.7162699999999999E-3,7.7169400000000001,4.9099999999999996E-10,-1.3999999999999999E-6,3.2859999999999999E-3,3.5890000000000002E-3,null,null,null,null,null,null,-6.8073E-6,-1.16E-3,1.0318087339999999,null,null,-4.0000000000000001E-3,9]
["V6-BC","27G","B",400,"BXRE",{"$f":"MasterTable[[#This Row],[Product Family]]&\"-\"&MasterTable[[#This Row],[CCT/CRI]]","v":"V6-BC-27G"},{"$f":"MasterTable[[#This Row],[Generation]]&\"-\"&MasterTable[[#This Row],[CCT/CRI]]&IF(MasterTable[[#This Row],[Lumen Family]]<999,\"0\"&MasterTable[[#This Row],[Lumen Family]],MasterTable[[#This Row],[Lumen Family]])&\"-\"&MasterTable[[#This Row],[Arrangement]]&\"-2x\"","v":"BXRE-27G0400-B-2x"},318,1.25,9,350,700,6,-9.3816900000000006E-12,1.6809100000000001E-8,-1.1390600000000001E-5,5.7162699999999999E-3,7.7169400000000001,4.9099999999999996E-10,-1.3999999999999999E-6,3.2859999999999999E-3,3.5890000000000002E-3,null,null,null,null,null,null,-6.8073E-6,-1.16E-3,1.0318087339999999,null,null,-4.0000000000000001E-3,9]
["V6-BC","30E","B",400,"BXRE",{"$f":"MasterTable[[#This Row],[Product Family]]&\"-\"&MasterTable[[#This Row],[CCT/CRI]]","v":"V6-BC-30E"},{"$f":"MasterTable[[#This Row],[Generation]]&\"-\"&MasterTable[[#This Row],[CCT/CRI]]&IF(MasterTable[[#This Row],[Lumen Family]]<999,\"0\"&MasterTable[[#This Row],[Lumen Family]],MasterTable[[#This Row],[Lumen Family]])&\"-\"&MasterTable[[#This Row],[Arrangement]]&\"-2x\"","v":"BXRE-30E0400-B-2x"},393,1.25,9,350,700,6,-9.3816900000000006E-12,1.6809100000000001E-8,-1.1390600000000001E-5,5.7162699999999999E-3,7.7169400000000001,4.9099999999999996E-10,-1.3999999999999999E-6,3.2859999999999999E-3,3.5890000000000002E-3,null,null,null,null,null,null,-6.8073E-6,-1.16E-3,1.0318087339999999,null,null,-4.0000000000000001E-3,9]
["V6-BC","30G","B",400,"BXRE",{"$f":"MasterTable[[#This Row],[Product Family]]&\"-\"&MasterTable[[#This Row],[CCT/CRI]]","v":"V6-BC-30G"},{"$f":"MasterTable[[#This Row],[Generation]]&\"-\"&MasterTable[[#This Row],[CCT/CRI]]&IF(MasterTable[[#This Row],[Lumen Family]]<999,\"0\"&MasterTable[[#This Row],[Lumen Family]],MasterTable[[#This Row],[Lumen Family]])&\"-\"&MasterTable[[#This Row],[Arrangement]]&\"-2x\"","v":"BXRE-30G0400-B-2x"},330,1.25,9,350,700,6,-9.3816900000000006E-12,1.6809100000000001E-8,-1.1390600000000001E-5,5.7162699999999999E-3,7.7169400000000001,4.9099999999999996E-10,-1.3999999999999999E-6,3.2859999999999999E-3,3.5890000000000002E-3,null,null,null,null,null,null,-6.8073E-6,-1.16E-3,1.0318087339999999,null,null,-4.0000000000000001E-3,9]
["V6-BC","35E","B",400,"BXRE",{"$f":"MasterTable[[#This Row],[Product Family]]&\"-\"&MasterTable[[#This Row],[CCT/CRI]]","v":"V6-BC-35E"},{"$f":"MasterTable[[#This Row],[Generation]]&\"-\"&MasterTable[[#This Row],[CCT/CRI]]&IF(MasterTable[[#This Row],[Lumen Family]]<999,\"0\"&MasterTable[[#This Row],[Lumen Family]],MasterTable[[#This Row],[Lumen Family]])&\"-\"&MasterTable[[#This Row],[Arrangement]]&\"-2x\"","v":"BXRE-35E0400-B-2x"},403,1.25,9,350,700,6,-9.3816900000000006E-12,1.6809100000000001E-8,-1.1390600000000001E-5,5.7162699999999999E-3,7.7169400000000001,4.9099999999999996E-10,-1.3999999999999999E-6,3.2859999999999999E-3,3.5890000000000002E-3,null,null,null,null,null,null,-6.8073E-6,-1.16E-3,1.0318087339999999,null,null,-4.0000000000000001E-3,9]
["V6-BC","35G","B",400,"BXRE",{"$f":"MasterTable[[#This Row],[Product Family]]&\"-\"&MasterTable[[#This Row],[CCT/CRI]]","v":"V6-BC-35G"},{"$f":"MasterTable[[#This Row],[Generation]]&\"-\"&MasterTable[[#This Row],[CCT/CRI]]&IF(MasterTable[[#This Row],[Lumen Family]]<999,\"0\"&MasterTable[[#This Row],[Lumen Family]],MasterTable[[#This Row],[Lumen Family]])&\"-\"&MasterTable[[#This Row],[Arrangement]]&\"-2x\"","v":"BXRE-35G0400-B-2x"},344,1.25,9,350,700,6,-9.3816900000000006E-12,1.6809100000000001E-8,-1.1390600000000001E-5,5.7162699999999999E-3,7.7169400000000001,4.9099999999999996E-10,-1.3999999999999999E-6,3.2859999999999999E-3,3.5890000000000002E-3,null,null,null,null,null,null,-6.8073E-6,-1.16E-3,1.0318087339999999,null,null,-4.0000000000000001E-3,9]
["V6-BC","40E","B",400,"BXRE",{"$f":"MasterTable[[#This Row],[Product Family]]&\"-\"&MasterTable[[#This Row],[CCT/CRI]]","v":"V6-BC-40E"},{"$f":"MasterTable[[#This Row],[Generation]]&\"-\"&MasterTable[[#This Row],[CCT/CRI]]&IF(MasterTable[[#This Row],[Lumen Family]]<999,\"0\"&MasterTable[[#This Row],[Lumen Family]],MasterTable[[#This Row],[Lumen Family]])&\"-\"&MasterTable[[#This Row],[Arrangement]]&\"-2x\"","v":"BXRE-40E0400-B-2x"},409,1.25,9,350,700,6,-9.3816900000000006E-12,1.6809100000000001E-8,-1.1390600000000001E-5,5.7162699999999999E-3,7.7169400000000001,4.9099999999999996E-10,-1.3999999999999999E-6,3.2859999999999999E-3,3.5890000000000002E-3,null,null,null,null,null,null,-6.1E-6,-1.1199999999999999E-3,1.031425,null,null,-4.0000000000000001E-3,9]
["V6-BC","50C","B",400,"BXRE",{"$f":"MasterTable[[#This Row],[Product Family]]&\"-\"&MasterTable[[#This Row],[CCT/CRI]]","v":"V6-BC-50C"},{"$f":"MasterTable[[#This Row],[Generation]]&\"-\"&MasterTable[[#This Row],[CCT/CRI]]&IF(MasterTable[[#This Row],[Lumen Family]]<999,\"0\"&MasterTable[[#This Row],[Lumen Family]],MasterTable[[#This Row],[Lumen Family]])&\"-\"&MasterTable[[#This Row],[Arrangement]]&\"-2x\"","v":"BXRE-50C0400-B-2x"},439,1.25,9,350,700,6,-9.3816900000000006E-12,1.6809100000000001E-8,-1.1390600000000001E-5,5.7162699999999999E-3,7.7169400000000001,4.9099999999999996E-10,-1.3999999999999999E-6,3.2859999999999999E-3,3.5890000000000002E-3,null,null,null,null,null,null,-3.6500000000000002E-6,-1.81E-3,1.05,null,null,-4.0000000000000001E-3,9]
["V6-BC","50E","B",400,"BXRE",{"$f":"MasterTable[[#This Row],[Product Family]]&\"-\"&MasterTable[[#This Row],[CCT/CRI]]","v":"V6-BC-50E"},{"$f":"MasterTable[[#This Row],[Generation]]&\"-\"&MasterTable[[#This Row],[CCT/CRI]]&IF(MasterTable[[#This Row],[Lumen Family]]<999,\"0\"&MasterTable[[#This Row],[Lumen Family]],MasterTable[[#This Row],[Lumen Family]])&\"-\"&MasterTable[[#This Row],[Arrangement]]&\"-2x\"","v":"BXRE-50E0400-B-2x"},412,1.25,9,350,700,6,-9.3816900000000006E-12,1.6809100000000001E-8,-1.1390600000000001E-5,5.7162699999999999E-3,7.7169400000000001,4.9099999999999996E-10,-1.3999999999999999E-6,3.2859999999999999E-3,3.5890000000000002E-3,null,null,null,null,null,null,-3.6500000000000002E-6,-1.81E-3,1.05,null,null,-4.0000000000000001E-3,9]
["V8-AH","30E","A",500,"BXRE",{"$f":"MasterTable[[#This Row],[Product Family]]&\"-\"&MasterTable[[#This Row],[CCT/CRI]]","v":"V8-AH-30E"},{"$f":"MasterTable[[#This Row],[Generation]]&\"-\"&MasterTable[[#This Row],[CCT/CRI]]&IF(MasterTable[[#This Row],[Lumen Family]]<999,\"0\"&MasterTable[[#This Row],[Lumen Family]],MasterTable[[#This Row],[Lumen Family]])&\"-\"&MasterTable[[#This Row],[Arrangement]]&\"-2x\"","v":"BXRE-30E0500-A-2x"},485,0.74,23.7,175,350,8,-5.6086900000000004E-10,5.0786299999999997E-7,-1.72747E-4,4.22803E-2,30.766300000000001,null,-3.3003500000000001E-6,6.2553699999999997E-3,6.7619300000000002E-3,null,null,null,null,null,null,-3.3920299999999999E-6,-1.4149799999999999E-3,1.0370299999999999,null,null,-2.4E-2,36.200000000000003]
["V8-AH","30G","A",500,"BXRE",{"$f":"MasterTable[[#This Row],[Product Family]]&\"-\"&MasterTable[[#This Row],[CCT/CRI]]","v":"V8-AH-30G"},{"$f":"MasterTable[[#This Row],[Generation]]&\"-\"&MasterTable[[#This Row],[CCT/CRI]]&IF(MasterTable[[#This Row],[Lumen Family]]<999,\"0\"&MasterTable[[#This Row],[Lumen Family]],MasterTable[[#This Row],[Lumen Family]])&\"-\"&MasterTable[[#This Row],[Arrangement]]&\"-2x\"","v":"BXRE-30G0500-A-2x"},415,0.74,23.7,175,350,8,-5.6086900000000004E-10,5.0786299999999997E-7,-1.72747E-4,4.22803E-2,30.766300000000001,null,-3.3003500000000001E-6,6.2553699999999997E-3,6.7619300000000002E-3,null,null,null,null,null,null,-3.3920299999999999E-6,-1.4149799999999999E-3,1.0370299999999999,null,null,-2.4E-2,36.200000000000003]
["V8-AH","40E","A",500,"BXRE",{"$f":"MasterTable[[#This Row],[Product Family]]&\"-\"&MasterTable[[#This Row],[CCT/CRI]]","v":"V8-AH-40E"},{"$f":"MasterTable[[#This Row],[Generation]]&\"-\"&MasterTable[[#This Row],[CCT/CRI]]&IF(MasterTable[[#This Row],[Lumen Family]]<999,\"0\"&MasterTable[[#This Row],[Lumen Family]],MasterTable[[#This Row],[Lumen Family]])&\"-\"&MasterTable[[#This Row],[Arrangement]]&\"-2x\"","v":"BXRE-40E0500-A-2x"},520,0.74,23.7,175,350,8,-5.6086900000000004E-10,5.0786299999999997E-7,-1.72747E-4,4.22803E-2,30.766300000000001,null,-3.3003500000000001E-6,6.2553699999999997E-3,6.7619300000000002E-3,null,null,null,null,null,null,-4.1074800000000004E-6,-1.41216E-3,1.0375099999999999,null,null,-2.4E-2,36.200000000000003]
["V8-AH","50C","A",500,"BXRE",{"$f":"MasterTable[[#This Row],[Product Family]]&\"-\"&MasterTable[[#This Row],[CCT/CRI]]","v":"V8-AH-50C"},{"$f":"MasterTable[[#This Row],[Generation]]&\"-\"&MasterTable[[#This Row],[CCT/CRI]]&IF(MasterTable[[#This Row],[Lumen Family]]<999,\"0\"&MasterTable[[#This Row],[Lumen Family]],MasterTable[[#This Row],[Lumen Family]])&\"-\"&MasterTable[[#This Row],[Arrangement]]&\"-2x\"","v":"BXRE-50C0500-A-2x"},570,0.74,23.7,175,350,8,-5.6086900000000004E-10,5.0786299999999997E-7,-1.72747E-4,4.22803E-2,30.766300000000001,null,-3.3003500000000001E-6,6.2553699999999997E-3,6.7619300000000002E-3,null,null,null,null,null,null,-3.1447199999999999E-6,-1.8710199999999999E-3,1.0489900000000001,null,null,-2.4E-2,36.200000000000003]
["V8-AL","27E","A",800,"BXRE",{"$f":"MasterTable[[#This Row],[Product Family]]&\"-\"&MasterTable[[#This Row],[CCT/CRI]]","v":"V8-AL-27E"},{"$f":"MasterTable[[#This Row],[Generation]]&\"-\"&MasterTable[[#This Row],[CCT/CRI]]&IF(MasterTable[[#This Row],[Lumen Family]]<999,\"0\"&MasterTable[[#This Row],[Lumen Family]],MasterTable[[#This Row],[Lumen Family]])&\"-\"&MasterTable[[#This Row],[Arrangement]]&\"-2x\"","v":"BXRE-27E0800-A-2x"},740,0.71,35.6,175,350,12,-1.0000000000000001E-9,8.6600000000000005E-7,-2.7099999999999997E-4,5.4899999999999997E-2,30.6,null,-4.1047244976000001E-6,6.3759312470999998E-3,7.2647760056000002E-3,null,-4.297732518E-6,6.4097279003999998E-3,9.9090925157999995E-3,null,null,-4.645792711E-6,-1.4114017408E-3,1.0373962201,null,null,-1.7000000000000001E-2,36.024999999999999]
["V8-AL","27G","A",800,"BXRE",{"$f":"MasterTable[[#This Row],[Product Family]]&\"-\"&MasterTable[[#This Row],[CCT/CRI]]","v":"V8-AL-27G"},{"$f":"MasterTable[[#This Row],[Generation]]&\"-\"&MasterTable[[#This Row],[CCT/CRI]]&IF(MasterTable[[#This Row],[Lumen Family]]<999,\"0\"&MasterTable[[#This Row],[Lumen Family]],MasterTable[[#This Row],[Lumen Family]])&\"-\"&MasterTable[[#This Row],[Arrangement]]&\"-2x\"","v":"BXRE-27G0800-A-2x"},629,0.71,35.6,175,350,12,-1.0000000000000001E-9,8.6600000000000005E-7,-2.7099999999999997E-4,5.4899999999999997E-2,30.6,null,-4.1047244976000001E-6,6.3759312470999998E-3,7.2647760056000002E-3,null,-4.297732518E-6,6.4097279003999998E-3,9.9090925157999995E-3,null,null,-4.645792711E-6,-1.4114017408E-3,1.0373962201,null,null,-1.7000000000000001E-2,36.024999999999999]
["V8-AL","30E","A",800,"BXRE",{"$f":"MasterTable[[#This Row],[Product Family]]&\"-\"&MasterTable[[#This Row],[CCT/CRI]]","v":"V8-AL-30E"},{"$f":"MasterTable[[#This Row],[Generation]]&\"-\"&MasterTable[[#This Row],[CCT/CRI]]&IF(MasterTable[[#This Row],[Lumen Family]]<999,\"0\"&MasterTable[[#This Row],[Lumen Family]],MasterTable[[#This Row],[Lumen Family]])&\"-\"&MasterTable[[#This Row],[Arrangement]]&\"-2x\"","v":"BXRE-30E0800-A-2x"},785,0.71,35.6,175,350,12,-1.0000000000000001E-9,8.6600000000000005E-7,-2.7099999999999997E-4,5.4899999999999997E-2,30.6,null,-4.1047244976000001E-6,6.3759312470999998E-3,7.2647760056000002E-3,null,-4.297732518E-6,6.4097279003999998E-3,9.9090925157999995E-3,null,null,-4.645792711E-6,-1.4114017408E-3,1.0373962201,null,null,-1.7000000000000001E-2,36.024999999999999]
["V8-AL","30G","A",800,"BXRE",{"$f":"MasterTable[[#This Row],[Product Family]]&\"-\"&MasterTable[[#This Row],[CCT/CRI]]","v":"V8-AL-30G"},{"$f":"MasterTable[[#This Row],[Generation]]&\"-\"&MasterTable[[#This Row],[CCT/CRI]]&IF(MasterTable[[#This Row],[Lumen Family]]<999,\"0\"&MasterTable[[#This Row],[Lumen Family]],MasterTable[[#This Row],[Lumen Family]])&\"-\"&MasterTable[[#This Row],[Arrangement]]&\"-2x\"","v":"BXRE-30G0800-A-2x"},654,0.71,35.6,175,350,12,-1.0000000000000001E-9,8.6600000000000005E-7,-2.7099999999999997E-4,5.4899999999999997E-2,30.6,null,-4.1047244976000001E-6,6.3759312470999998E-3,7.2647760056000002E-3,null,-4.297732518E-6,6.4097279003999998E-3,9.9090925157999995E-3,null,null,-4.645792711E-6,-1.4114017408E-3,1.0373962201,null,null,-1.7000000000000001E-2,36.024999999999999]
["V8-AL","35E","A",800,"BXRE",{"$f":"MasterTable[[#This Row],[Product Family]]&\"-\"&MasterTable[[#This Row],[CCT/CRI]]","v":"V8-AL-35E"},{"$f":"MasterTable[[#This Row],[Generation]]&\"-\"&MasterTable[[#This Row],[CCT/CRI]]&IF(MasterTable[[#This Row],[Lumen Family]]<999,\"0\"&MasterTable[[#This Row],[Lumen Family]],MasterTable[[#This Row],[Lumen Family]])&\"-\"&MasterTable[[#This Row],[Arrangement]]&\"-2x\"","v":"BXRE-35E0800-A-2x"},803,0.71,35.6,175,350,12,-1.0000000000000001E-9,8.6600000000000005E-7,-2.7099999999999997E-4,5.4899999999999997E-2,30.6,null,-4.1047244976000001E-6,6.3759312470999998E-3,7.2647760056000002E-3,null,-4.297732518E-6,6.4097279003999998E-3,9.9090925157999995E-3,null,null,-4.645792711E-6,-1.4114017408E-3,1.0373962201,null,null,-1.7000000000000001E-2,36.024999999999999]
["V8-AL","35G","A",800,"BXRE",{"$f":"MasterTable[[#This Row],[Product Family]]&\"-\"&MasterTable[[#This Row],[CCT/CRI]]","v":"V8-AL-35G"},{"$f":"MasterTable[[#This Row],[Generation]]&\"-\"&MasterTable[[#This Row],[CCT/CRI]]&IF(MasterTable[[#This Row],[Lumen Family]]<999,\"0\"&MasterTable[[#This Row],[Lumen Family]],MasterTable[[#This Row],[Lumen Family]])&\"-\"&MasterTable[[#This Row],[Arrangement]]&\"-2x\"","v":"BXRE-35G0800-A-2x"},679,0.71,35.6,175,350,12,-1.0000000000000001E-9,8.6600000000000005E-7,-2.7099999999999997E-4,5.4899999999999997E-2,30.6,null,-4.1047244976000001E-6,6.3759312470999998E-3,7.2647760056000002E-3,null,-4.297732518E-6,6.4097279003999998E-3,9.9090925157999995E-3,null,null,-4.645792711E-6,-1.4114017408E-3,1.0373962201,null,null,-1.7000000000000001E-2,36.024999999999999]
["V8-AL","40E","A",800,"BXRE",{"$f":"MasterTable[[#This Row],[Product Family]]&\"-\"&MasterTable[[#This Row],[CCT/CRI]]","v":"V8-AL-40E"},{"$f":"MasterTable[[#This Row],[Generation]]&\"-\"&MasterTable[[#This Row],[CCT/CRI]]&IF(MasterTable[[#This Row],[Lumen Family]]<999,\"0\"&MasterTable[[#This Row],[Lumen Family]],MasterTable[[#This Row],[Lumen Family]])&\"-\"&MasterTable[[#This Row],[Arrangement]]&\"-2x\"","v":"BXRE-40E0800-A-2x"},829,0.71,35.6,175,350,12,-1.0000000000000001E-9,8.6600000000000005E-7,-2.7099999999999997E-4,5.4899999999999997E-2,30.6,null,-4.1047244976000001E-6,6.3759312470999998E-3,7.2647760056000002E-3,null,-4.297732518E-6,6.4097279003999998E-3,9.9090925157999995E-3,null,null,-6.6243244394999998E-6,-1.1278369862E-3,1.0309770566000001,null,null,-1.7000000000000001E-2,36.024999999999999]
["V8-AL","40G","A",800,"BXRE",{"$f":"MasterTable[[#This Row],[Product Family]]&\"-\"&MasterTable[[#This Row],[CCT/CRI]]","v":"V8-AL-40G"},{"$f":"MasterTable[[#This Row],[Generation]]&\"-\"&MasterTable[[#This Row],[CCT/CRI]]&IF(MasterTable[[#This Row],[Lumen Family]]<999,\"0\"&MasterTable[[#This Row],[Lumen Family]],MasterTable[[#This Row],[Lumen Family]])&\"-\"&MasterTable[[#This Row],[Arrangement]]&\"-2x\"","v":"BXRE-40G0800-A-2x"},716,0.71,35.6,175,350,12,-1.0000000000000001E-9,8.6600000000000005E-7,-2.7099999999999997E-4,5.4899999999999997E-2,30.6,null,-4.1047244976000001E-6,6.3759312470999998E-3,7.2647760056000002E-3,null,-4.297732518E-6,6.4097279003999998E-3,9.9090925157999995E-3,null,null,-6.6243244394999998E-6,-1.1278369862E-3,1.0309770566000001,null,null,-1.7000000000000001E-2,36.024999999999999]
["V8-AL","50C","A",800,"BXRE",{"$f":"MasterTable[[#This Row],[Product Family]]&\"-\"&MasterTable[[#This Row],[CCT/CRI]]","v":"V8-AL-50C"},{"$f":"MasterTable[[#This Row],[Generation]]&\"-\"&MasterTable[[#This Row],[CCT/CRI]]&IF(MasterTable[[#This Row],[Lumen Family]]<999,\"0\"&MasterTable[[#This Row],[Lumen Family]],MasterTable[[#This Row],[Lumen Family]])&\"-\"&MasterTable[[#This Row],[Arrangement]]&\"-2x\"","v":"BXRE-50C0800-A-2x"},885,0.71,35.6,175,350,12,-1.0000000000000001E-9,8.6600000000000005E-7,-2.7099999999999997E-4,5.4899999999999997E-2,30.6,null,-4.1047244976000001E-6,6.3759312470999998E-3,7.2647760056000002E-3,null,-4.297732518E-6,6.4097279003999998E-3,9.9090925157999995E-3,null,null,-3.0947374912999999E-6,-1.6262495714E-3,1.0400452693,null,null,-1.7000000000000001E-2,36.024999999999999]
["V8-AL","50E","A",800,"BXRE",{"$f":"MasterTable[[#This Row],[Product Family]]&\"-\"&MasterTable[[#This Row],[CCT/CRI]]","v":"V8-AL-50E"},{"$f":"MasterTable[[#This Row],[Generation]]&\"-\"&MasterTable[[#This Row],[CCT/CRI]]&IF(MasterTable[[#This Row],[Lumen Family]]<999,\"0\"&MasterTable[[#This Row],[Lumen Family]],MasterTable[[#This Row],[Lumen Family]])&\"-\"&MasterTable[[#This Row],[Arrangement]]&\"-2x\"","v":"BXRE-50E0800-A-2x"},829,0.71,35.6,175,350,12,-1.0000000000000001E-9,8.6600000000000005E-7,-2.7099999999999997E-4,5.4899999999999997E-2,30.6,null,-4.1047244976000001E-6,6.3759312470999998E-3,7.2647760056000002E-3,null,-4.297732518E-6,6.4097279003999998E-3,9.9090925157999995E-3,null,null,-3.0947374912999999E-6,-1.6262495714E-3,1.0400452693,null,null,-1.7000000000000001E-2,36.024999999999999]
["V8-BF","27E","B",800,"BXRE",{"$f":"MasterTable[[#This Row],[Product Family]]&\"-\"&MasterTable[[#This Row],[CCT/CRI]]","v":"V8-BF-27E"},{"$f":"MasterTable[[#This Row],[Generation]]&\"-\"&MasterTable[[#This Row],[CCT/CRI]]&IF(MasterTable[[#This Row],[Lumen Family]]<999,\"0\"&MasterTable[[#This Row],[Lumen Family]],MasterTable[[#This Row],[Lumen Family]])&\"-\"&MasterTable[[#This Row],[Arrangement]]&\"-2x\"","v":"BXRE-27E0800-B-2x"},740,0.71,17.8,350,700,12,-7.4382650239000006E-11,9.4360629142000003E-8,-4.4394203422999998E-5,1.4251995236000001E-2,15.324318705,null,-1.0261811244E-6,3.1879656235999998E-3,7.2647760056000002E-3,null,-1.0744331295E-6,3.2048639501999999E-3,9.9090925157999995E-3,null,null,-4.645792711E-6,-1.4114017408E-3,1.0373962201,null,null,-7.0000000000000001E-3,17.975000000000001]
["V8-BF","27G","B",800,"BXRE",{"$f":"MasterTable[[#This Row],[Product Family]]&\"-\"&MasterTable[[#This Row],[CCT/CRI]]","v":"V8-BF-27G"},{"$f":"MasterTable[[#This Row],[Generation]]&\"-\"&MasterTable[[#This Row],[CCT/CRI]]&IF(MasterTable[[#This Row],[Lumen Family]]<999,\"0\"&MasterTable[[#This Row],[Lumen Family]],MasterTable[[#This Row],[Lumen Family]])&\"-\"&MasterTable[[#This Row],[Arrangement]]&\"-2x\"","v":"BXRE-27G0800-B-2x"},629,0.71,17.8,350,700,12,-7.4382650239000006E-11,9.4360629142000003E-8,-4.4394203422999998E-5,1.4251995236000001E-2,15.324318705,null,-1.0261811244E-6,3.1879656235999998E-3,7.2647760056000002E-3,null,-1.0744331295E-6,3.2048639501999999E-3,9.9090925157999995E-3,null,null,-4.645792711E-6,-1.4114017408E-3,1.0373962201,null,null,-7.0000000000000001E-3,17.975000000000001]
["V8-BF","30E","B",800,"BXRE",{"$f":"MasterTable[[#This Row],[Product Family]]&\"-\"&MasterTable[[#This Row],[CCT/CRI]]","v":"V8-BF-30E"},{"$f":"MasterTable[[#This Row],[Generation]]&\"-\"&MasterTable[[#This Row],[CCT/CRI]]&IF(MasterTable[[#This Row],[Lumen Family]]<999,\"0\"&MasterTable[[#This Row],[Lumen Family]],MasterTable[[#This Row],[Lumen Family]])&\"-\"&MasterTable[[#This Row],[Arrangement]]&\"-2x\"","v":"BXRE-30E0800-B-2x"},785,0.71,17.8,350,700,12,-7.4382650239000006E-11,9.4360629142000003E-8,-4.4394203422999998E-5,1.4251995236000001E-2,15.324318705,null,-1.0261811244E-6,3.1879656235999998E-3,7.2647760056000002E-3,null,-1.0744331295E-6,3.2048639501999999E-3,9.9090925157999995E-3,null,null,-4.645792711E-6,-1.4114017408E-3,1.0373962201,null,null,-7.0000000000000001E-3,17.975000000000001]
["V8-BF","30G","B",800,"BXRE",{"$f":"MasterTable[[#This Row],[Product Family]]&\"-\"&MasterTable[[#This Row],[CCT/CRI]]","v":"V8-BF-30G"},{"$f":"MasterTable[[#This Row],[Generation]]&\"-\"&MasterTable[[#This Row],[CCT/CRI]]&IF(MasterTable[[#This Row],[Lumen Family]]<999,\"0\"&MasterTable[[#This Row],[Lumen Family]],MasterTable[[#This Row],[Lumen Family]])&\"-\"&MasterTable[[#This Row],[Arrangement]]&\"-2x\"","v":"BXRE-30G0800-B-2x"},654,0.71,17.8,350,700,12,-7.4382650239000006E-11,9.4360629142000003E-8,-4.4394203422999998E-5,1.4251995236000001E-2,15.324318705,null,-1.0261811244E-6,3.1879656235999998E-3,7.2647760056000002E-3,null,-1.0744331295E-6,3.2048639501999999E-3,9.9090925157999995E-3,null,null,-4.645792711E-6,-1.4114017408E-3,1.0373962201,null,null,-7.0000000000000001E-3,17.975000000000001]
["V8-BF","35E","B",800,"BXRE",{"$f":"MasterTable[[#This Row],[Product Family]]&\"-\"&MasterTable[[#This Row],[CCT/CRI]]","v":"V8-BF-35E"},{"$f":"MasterTable[[#This Row],[Generation]]&\"-\"&MasterTable[[#This Row],[CCT/CRI]]&IF(MasterTable[[#This Row],[Lumen Family]]<999,\"0\"&MasterTable[[#This Row],[Lumen Family]],MasterTable[[#This Row],[Lumen Family]])&\"-\"&MasterTable[[#This Row],[Arrangement]]&\"-2x\"","v":"BXRE-35E0800-B-2x"},803,0.71,17.8,350,700,12,-7.4382650239000006E-11,9.4360629142000003E-8,-4.4394203422999998E-5,1.4251995236000001E-2,15.324318705,null,-1.0261811244E-6,3.1879656235999998E-3,7.2647760056000002E-3,null,-1.0744331295E-6,3.2048639501999999E-3,9.9090925157999995E-3,null,null,-4.645792711E-6,-1.4114017408E-3,1.0373962201,null,null,-7.0000000000000001E-3,17.975000000000001]
["V8-BF","35G","B",800,"BXRE",{"$f":"MasterTable[[#This Row],[Product Family]]&\"-\"&MasterTable[[#This Row],[CCT/CRI]]","v":"V8-BF-35G"},{"$f":"MasterTable[[#This Row],[Generation]]&\"-\"&MasterTable[[#This Row],[CCT/CRI]]&IF(MasterTable[[#This Row],[Lumen Family]]<999,\"0\"&MasterTable[[#This Row],[Lumen Family]],MasterTable[[#This Row],[Lumen Family]])&\"-\"&MasterTable[[#This Row],[Arrangement]]&\"-2x\"","v":"BXRE-35G0800-B-2x"},679,0.71,17.8,350,700,12,-7.4382650239000006E-11,9.4360629142000003E-8,-4.4394203422999998E-5,1.4251995236000001E-2,15.324318705,null,-1.0261811244E-6,3.1879656235999998E-3,7.2647760056000002E-3,null,-1.0744331295E-6,3.2048639501999999E-3,9.9090925157999995E-3,null,null,-4.645792711E-6,-1.4114017408E-3,1.0373962201,null,null,-7.0000000000000001E-3,17.975000000000001]
["V8-BF","40E","B",800,"BXRE",{"$f":"MasterTable[[#This Row],[Product Family]]&\"-\"&MasterTable[[#This Row],[CCT/CRI]]","v":"V8-BF-40E"},{"$f":"MasterTable[[#This Row],[Generation]]&\"-\"&MasterTable[[#This Row],[CCT/CRI]]&IF(MasterTable[[#This Row],[Lumen Family]]<999,\"0\"&MasterTable[[#This Row],[Lumen Family]],MasterTable[[#This Row],[Lumen Family]])&\"-\"&MasterTable[[#This Row],[Arrangement]]&\"-2x\"","v":"BXRE-40E0800-B-2x"},829,0.71,17.8,350,700,12,-7.4382650239000006E-11,9.4360629142000003E-8,-4.4394203422999998E-5,1.4251995236000001E-2,15.324318705,null,-1.0261811244E-6,3.1879656235999998E-3,7.2647760056000002E-3,null,-1.0744331295E-6,3.2048639501999999E-3,9.9090925157999995E-3,null,null,-6.6243244394999998E-6,-1.1278369862E-3,1.0309770566000001,null,null,-7.0000000000000001E-3,17.975000000000001]
["V8-BF","40G","B",800,"BXRE",{"$f":"MasterTable[[#This Row],[Product Family]]&\"-\"&MasterTable[[#This Row],[CCT/CRI]]","v":"V8-BF-40G"},{"$f":"MasterTable[[#This Row],[Generation]]&\"-\"&MasterTable[[#This Row],[CCT/CRI]]&IF(MasterTable[[#This Row],[Lumen Family]]<999,\"0\"&MasterTable[[#This Row],[Lumen Family]],MasterTable[[#This Row],[Lumen Family]])&\"-\"&MasterTable[[#This Row],[Arrangement]]&\"-2x\"","v":"BXRE-40G0800-B-2x"},716,0.71,17.8,350,700,12,-7.4382650239000006E-11,9.4360629142000003E-8,-4.4394203422999998E-5,1.4251995236000001E-2,15.324318705,null,-1.0261811244E-6,3.1879656235999998E-3,7.2647760056000002E-3,null,-1.0744331295E-6,3.2048639501999999E-3,9.9090925157999995E-3,null,null,-6.6243244394999998E-6,-1.1278369862E-3,1.0309770566000001,null,null,-7.0000000000000001E-3,17.975000000000001]
["V8-BF","50C","B",800,"BXRE",{"$f":"MasterTable[[#This Row],[Product Family]]&\"-\"&MasterTable[[#This Row],[CCT/CRI]]","v":"V8-BF-50C"},{"$f":"MasterTable[[#This Row],[Generation]]&\"-\"&MasterTable[[#This Row],[CCT/CRI]]&IF(MasterTable[[#This Row],[Lumen Family]]<999,\"0\"&MasterTable[[#This Row],[Lumen Family]],MasterTable[[#This Row],[Lumen Family]])&\"-\"&MasterTable[[#This Row],[Arrangement]]&\"-2x\"","v":"BXRE-50C0800-B-2x"},885,0.71,17.8,350,700,12,-7.4382650239000006E-11,9.4360629142000003E-8,-4.4394203422999998E-5,1.4251995236000001E-2,15.324318705,null,-1.0261811244E-6,3.1879656235999998E-3,7.2647760056000002E-3,null,-1.0744331295E-6,3.2048639501999999E-3,9.9090925157999995E-3,null,null,-3.0947374912999999E-6,-1.6262495714E-3,1.0400452693,null,null,-7.0000000000000001E-3,17.975000000000001]
["V8-BF","50E","B",800,"BXRE",{"$f":"MasterTable[[#This Row],[Product Family]]&\"-\"&MasterTable[[#This Row],[CCT/CRI]]","v":"V8-BF-50E"},{"$f":"MasterTable[[#This Row],[Generation]]&\"-\"&MasterTable[[#This Row],[CCT/CRI]]&IF(MasterTable[[#This Row],[Lumen Family]]<999,\"0\"&MasterTable[[#This Row],[Lumen Family]],MasterTable[[#This Row],[Lumen Family]])&\"-\"&MasterTable[[#This Row],[Arrangement]]&\"-2x\"","v":"BXRE-50E0800-B-2x"},829,0.71,17.8,350,700,12,-7.4382650239000006E-11,9.4360629142000003E-8,-4.4394203422999998E-5,1.4251995236000001E-2,15.324318705,null,-1.0261811244E-6,3.1879656235999998E-3,7.2647760056000002E-3,null,-1.0744331295E-6,3.2048639501999999E-3,9.9090925157999995E-3,null,null,-3.0947374912999999E-6,-1.6262495714E-3,1.0400452693,null,null,-7.0000000000000001E-3,17.975000000000001]
["V10-BI","27E","B",1000,"BXRE",{"$f":"MasterTable[[#This Row],[Product Family]]&\"-\"&MasterTable[[#This Row],[CCT/CRI]]","v":"V10-BI-27E"},{"$f":"MasterTable[[#This Row],[Generation]]&\"-\"&MasterTable[[#This Row],[CCT/CRI]]&IF(MasterTable[[#This Row],[Lumen Family]]<999,\"0\"&MasterTable[[#This Row],[Lumen Family]],MasterTable[[#This Row],[Lumen Family]])&\"-\"&MasterTable[[#This Row],[Arrangement]]&\"-2x\"","v":"BXRE-27E1000-B-2x"},1150,0.47,26.5,350,700,18,-3.2099999999999998E-11,5.4800000000000001E-8,-3.5200000000000002E-5,1.78E-2,22.7,null,-8.2389999999999996E-7,3.1546209999999998E-3,0,null,-9.0820000000000005E-7,2.8630102000000001E-3,0,null,null,-5.7894E-6,-1.1976858E-3,1.0323639969,null,null,-1.4E-2,26.85]
["V10-BI","27G","B",1000,"BXRE",{"$f":"MasterTable[[#This Row],[Product Family]]&\"-\"&MasterTable[[#This Row],[CCT/CRI]]","v":"V10-BI-27G"},{"$f":"MasterTable[[#This Row],[Generation]]&\"-\"&MasterTable[[#This Row],[CCT/CRI]]&IF(MasterTable[[#This Row],[Lumen Family]]<999,\"0\"&MasterTable[[#This Row],[Lumen Family]],MasterTable[[#This Row],[Lumen Family]])&\"-\"&MasterTable[[#This Row],[Arrangement]]&\"-2x\"","v":"BXRE-27G1000-B-2x"},946,0.47,26.5,350,700,18,-3.2099999999999998E-11,5.4800000000000001E-8,-3.5200000000000002E-5,1.78E-2,22.7,null,-8.2389999999999996E-7,3.1546209999999998E-3,0,null,-9.0820000000000005E-7,2.8630102000000001E-3,0,null,null,-5.7894E-6,-1.1976858E-3,1.0323639969,null,null,-1.4E-2,26.85]
["V10-BI","30E","B",1000,"BXRE",{"$f":"MasterTable[[#This Row],[Product Family]]&\"-\"&MasterTable[[#This Row],[CCT/CRI]]","v":"V10-BI-30E"},{"$f":"MasterTable[[#This Row],[Generation]]&\"-\"&MasterTable[[#This Row],[CCT/CRI]]&IF(MasterTable[[#This Row],[Lumen Family]]<999,\"0\"&MasterTable[[#This Row],[Lumen Family]],MasterTable[[#This Row],[Lumen Family]])&\"-\"&MasterTable[[#This Row],[Arrangement]]&\"-2x\"","v":"BXRE-30E1000-B-2x"},1200,0.47,26.5,350,700,18,-3.2099999999999998E-11,5.4800000000000001E-8,-3.5200000000000002E-5,1.78E-2,22.7,null,-8.2389999999999996E-7,3.1546209999999998E-3,0,null,-9.0820000000000005E-7,2.8630102000000001E-3,0,null,null,-5.5415999999999996E-6,-1.107058E-3,1.0297907406,null,null,-1.4E-2,26.85]
["V10-BI","30G","B",1000,"BXRE",{"$f":"MasterTable[[#This Row],[Product Family]]&\"-\"&MasterTable[[#This Row],[CCT/CRI]]","v":"V10-BI-30G"},{"$f":"MasterTable[[#This Row],[Generation]]&\"-\"&MasterTable[[#This Row],[CCT/CRI]]&IF(MasterTable[[#This Row],[Lumen Family]]<999,\"0\"&MasterTable[[#This Row],[Lumen Family]],MasterTable[[#This Row],[Lumen Family]])&\"-\"&MasterTable[[#This Row],[Arrangement]]&\"-2x\"","v":"BXRE-30G1000-B-2x"},983,0.47,26.5,350,700,18,-3.2099999999999998E-11,5.4800000000000001E-8,-3.5200000000000002E-5,1.78E-2,22.7,null,-8.2389999999999996E-7,3.1546209999999998E-3,0,null,-9.0820000000000005E-7,2.8630102000000001E-3,0,null,null,-5.5415999999999996E-6,-1.107058E-3,1.0297907406,null,null,-1.4E-2,26.85]
["V10-BI","35E","B",1000,"BXRE",{"$f":"MasterTable[[#This Row],[Product Family]]&\"-\"&MasterTable[[#This Row],[CCT/CRI]]","v":"V10-BI-35E"},{"$f":"MasterTable[[#This Row],[Generation]]&\"-\"&MasterTable[[#This Row],[CCT/CRI]]&IF(MasterTable[[#This Row],[Lumen Family]]<999,\"0\"&MasterTable[[#This Row],[Lumen Family]],MasterTable[[#This Row],[Lumen Family]])&\"-\"&MasterTable[[#This Row],[Arrangement]]&\"-2x\"","v":"BXRE-35E1000-B-2x"},1229,0.47,26.5,350,700,18,-3.2099999999999998E-11,5.4800000000000001E-8,-3.5200000000000002E-5,1.78E-2,22.7,null,-8.2389999999999996E-7,3.1546209999999998E-3,0,null,-9.0820000000000005E-7,2.8630102000000001E-3,0,null,null,-5.5415999999999996E-6,-1.107058E-3,1.0297907406,null,null,-1.4E-2,26.85]
["V10-BI","35G","B",1000,"BXRE",{"$f":"MasterTable[[#This Row],[Product Family]]&\"-\"&MasterTable[[#This Row],[CCT/CRI]]","v":"V10-BI-35G"},{"$f":"MasterTable[[#This Row],[Generation]]&\"-\"&MasterTable[[#This Row],[CCT/CRI]]&IF(MasterTable[[#This Row],[Lumen Family]]<999,\"0\"&MasterTable[[#This Row],[Lumen Family]],MasterTable[[#This Row],[Lumen Family]])&\"-\"&MasterTable[[#This Row],[Arrangement]]&\"-2x\"","v":"BXRE-35G1000-B-2x"},1039,0.47,26.5,350,700,18,-3.2099999999999998E-11,5.4800000000000001E-8,-3.5200000000000002E-5,1.78E-2,22.7,null,-8.2389999999999996E-7,3.1546209999999998E-3,0,null,-9.0820000000000005E-7,2.8630102000000001E-3,0,null,null,-5.5415999999999996E-6,-1.107058E-3,1.0297907406,null,null,-1.4E-2,26.85]
["V10-BI","40E","B",1000,"BXRE",{"$f":"MasterTable[[#This Row],[Product Family]]&\"-\"&MasterTable[[#This Row],[CCT/CRI]]","v":"V10-BI-40E"},{"$f":"MasterTable[[#This Row],[Generation]]&\"-\"&MasterTable[[#This Row],[CCT/CRI]]&IF(MasterTable[[#This Row],[Lumen Family]]<999,\"0\"&MasterTable[[#This Row],[Lumen Family]],MasterTable[[#This Row],[Lumen Family]])&\"-\"&MasterTable[[#This Row],[Arrangement]]&\"-2x\"","v":"BXRE-40E1000-B-2x"},1252,0.47,26.5,350,700,18,-3.2099999999999998E-11,5.4800000000000001E-8,-3.5200000000000002E-5,1.78E-2,22.7,null,-8.2389999999999996E-7,3.1546209999999998E-3,0,null,-9.0820000000000005E-7,2.8630102000000001E-3,0,null,null,-4.8574999999999997E-6,-1.1899886999999999E-3,1.0322715723,null,null,-1.4E-2,26.85]
["V10-BI","40G","B",1000,"BXRE",{"$f":"MasterTable[[#This Row],[Product Family]]&\"-\"&MasterTable[[#This Row],[CCT/CRI]]","v":"V10-BI-40G"},{"$f":"MasterTable[[#This Row],[Generation]]&\"-\"&MasterTable[[#This Row],[CCT/CRI]]&IF(MasterTable[[#This Row],[Lumen Family]]<999,\"0\"&MasterTable[[#This Row],[Lumen Family]],MasterTable[[#This Row],[Lumen Family]])&\"-\"&MasterTable[[#This Row],[Arrangement]]&\"-2x\"","v":"BXRE-40G1000-B-2x"},1076,0.47,26.5,350,700,18,-3.2099999999999998E-11,5.4800000000000001E-8,-3.5200000000000002E-5,1.78E-2,22.7,null,-8.2389999999999996E-7,3.1546209999999998E-3,0,null,-9.0820000000000005E-7,2.8630102000000001E-3,0,null,null,-4.8574999999999997E-6,-1.1899886999999999E-3,1.0322715723,null,null,-1.4E-2,26.85]
["V10-BI","50C","B",1000,"BXRE",{"$f":"MasterTable[[#This Row],[Product Family]]&\"-\"&MasterTable[[#This Row],[CCT/CRI]]","v":"V10-BI-50C"},{"$f":"MasterTable[[#This Row],[Generation]]&\"-\"&MasterTable[[#This Row],[CCT/CRI]]&IF(MasterTable[[#This Row],[Lumen Family]]<999,\"0\"&MasterTable[[#This Row],[Lumen Family]],MasterTable[[#This Row],[Lumen Family]])&\"-\"&MasterTable[[#This Row],[Arrangement]]&\"-2x\"","v":"BXRE-50C1000-B-2x"},1330,0.47,26.5,350,700,18,-3.2099999999999998E-11,5.4800000000000001E-8,-3.5200000000000002E-5,1.78E-2,22.7,null,-8.2389999999999996E-7,3.1546209999999998E-3,0,null,-9.0820000000000005E-7,2.8630102000000001E-3,0,null,null,-3.0728E-6,-1.8775262999999999E-3,1.0490946606,null,null,-1.4E-2,26.85]
["V10-BI","50E","B",1000,"BXRE",{"$f":"MasterTable[[#This Row],[Product Family]]&\"-\"&MasterTable[[#This Row],[CCT/CRI]]","v":"V10-BI-50E"},{"$f":"MasterTable[[#This Row],[Generation]]&\"-\"&MasterTable[[#This Row],[CCT/CRI]]&IF(MasterTable[[#This Row],[Lumen Family]]<999,\"0\"&MasterTable[[#This Row],[Lumen Family]],MasterTable[[#This Row],[Lumen Family]])&\"-\"&MasterTable[[#This Row],[Arrangement]]&\"-2x\"","v":"BXRE-50E1000-B-2x"},1257,0.47,26.5,350,700,18,-3.2099999999999998E-11,5.4800000000000001E-8,-3.5200000000000002E-5,1.78E-2,22.7,null,-8.2389999999999996E-7,3.1546209999999998E-3,0,null,-9.0820000000000005E-7,2.8630102000000001E-3,0,null,null,-3.0728E-6,-1.8775262999999999E-3,1.0490946606,null,null,-1.4E-2,26.85]
["V10-BI","50G","B",1000,"BXRE",{"$f":"MasterTable[[#This Row],[Product Family]]&\"-\"&MasterTable[[#This Row],[CCT/CRI]]","v":"V10-BI-50G"},{"$f":"MasterTable[[#This Row],[Generation]]&\"-\"&MasterTable[[#This Row],[CCT/CRI]]&IF(MasterTable[[#This Row],[Lumen Family]]<999,\"0\"&MasterTable[[#This Row],[Lumen Family]],MasterTable[[#This Row],[Lumen Family]])&\"-\"&MasterTable[[#This Row],[Arrangement]]&\"-2x\"","v":"BXRE-50G1000-B-2x"},1106,0.47,26.5,350,700,18,-3.2099999999999998E-11,5.4800000000000001E-8,-3.5200000000000002E-5,1.78E-2,22.7,null,-8.2389999999999996E-7,3.1546209999999998E-3,0,null,-9.0820000000000005E-7,2.8630102000000001E-3,0,null,null,-3.0728E-6,-1.8775262999999999E-3,1.0490946606,null,null,-1.4E-2,26.85]
["V13-C","27E","C",2000,"BXRE",{"$f":"MasterTable[[#This Row],[Product Family]]&\"-\"&MasterTable[[#This Row],[CCT/CRI]]","v":"V13-C-27E"},{"$f":"MasterTable[[#This Row],[Generation]]&\"-\"&MasterTable[[#This Row],[CCT/CRI]]&IF(MasterTable[[#This Row],[Lumen Family]]<999,\"0\"&MasterTable[[#This Row],[Lumen Family]],MasterTable[[#This Row],[Lumen Family]])&\"-\"&MasterTable[[#This Row],[Arrangement]]&\"-2x\"","v":"BXRE-27E2000-C-2x"},2019,0.22,32.299999999999997,500,1050,33,-9.5076604018999997E-12,2.4428286607E-8,-2.3169246580000001E-5,1.4970494217E-2,28.116669275,null,-5.2056577008E-7,2.2529763468E-3,4.8311928226E-3,null,-4.9200361948999999E-7,2.2350279158000002E-3,6.8891795015E-3,-3.29E-9,5.2499999999999995E-7,-2.5199999999999999E-5,-1.24E-3,1.04,null,null,-1.7000000000000001E-2,32.725000000000001]
["V13-C","27G","C",2000,"BXRE",{"$f":"MasterTable[[#This Row],[Product Family]]&\"-\"&MasterTable[[#This Row],[CCT/CRI]]","v":"V13-C-27G"},{"$f":"MasterTable[[#This Row],[Generation]]&\"-\"&MasterTable[[#This Row],[CCT/CRI]]&IF(MasterTable[[#This Row],[Lumen Family]]<999,\"0\"&MasterTable[[#This Row],[Lumen Family]],MasterTable[[#This Row],[Lumen Family]])&\"-\"&MasterTable[[#This Row],[Arrangement]]&\"-2x\"","v":"BXRE-27G2000-C-2x"},1680,0.22,32.299999999999997,500,1050,33,-9.5076604018999997E-12,2.4428286607E-8,-2.3169246580000001E-5,1.4970494217E-2,28.116669275,null,-5.2056577008E-7,2.2529763468E-3,4.8311928226E-3,null,-4.9200361948999999E-7,2.2350279158000002E-3,6.8891795015E-3,-3.29E-9,5.2499999999999995E-7,-2.5199999999999999E-5,-1.24E-3,1.04,null,null,-1.7000000000000001E-2,32.725000000000001]
["V13-C","30E","C",2000,"BXRE",{"$f":"MasterTable[[#This Row],[Product Family]]&\"-\"&MasterTable[[#This Row],[CCT/CRI]]","v":"V13-C-30E"},{"$f":"MasterTable[[#This Row],[Generation]]&\"-\"&MasterTable[[#This Row],[CCT/CRI]]&IF(MasterTable[[#This Row],[Lumen Family]]<999,\"0\"&MasterTable[[#This Row],[Lumen Family]],MasterTable[[#This Row],[Lumen Family]])&\"-\"&MasterTable[[#This Row],[Arrangement]]&\"-2x\"","v":"BXRE-30E2000-C-2x"},2120,0.22,32.299999999999997,500,1050,33,-9.5076604018999997E-12,2.4428286607E-8,-2.3169246580000001E-5,1.4970494217E-2,28.116669275,null,-5.2056577008E-7,2.2529763468E-3,4.8311928226E-3,null,-4.9200361948999999E-7,2.2350279158000002E-3,6.8891795015E-3,-3.29E-9,5.2499999999999995E-7,-2.5199999999999999E-5,-1.24E-3,1.04,null,null,-1.7000000000000001E-2,32.725000000000001]
["V13-C","30G","C",2000,"BXRE",{"$f":"MasterTable[[#This Row],[Product Family]]&\"-\"&MasterTable[[#This Row],[CCT/CRI]]","v":"V13-C-30G"},{"$f":"MasterTable[[#This Row],[Generation]]&\"-\"&MasterTable[[#This Row],[CCT/CRI]]&IF(MasterTable[[#This Row],[Lumen Family]]<999,\"0\"&MasterTable[[#This Row],[Lumen Family]],MasterTable[[#This Row],[Lumen Family]])&\"-\"&MasterTable[[#This Row],[Arrangement]]&\"-2x\"","v":"BXRE-30G2000-C-2x"},1760,0.22,32.299999999999997,500,1050,33,-9.5076604018999997E-12,2.4428286607E-8,-2.3169246580000001E-5,1.4970494217E-2,28.116669275,null,-5.2056577008E-7,2.2529763468E-3,4.8311928226E-3,null,-4.9200361948999999E-7,2.2350279158000002E-3,6.8891795015E-3,-3.29E-9,5.2499999999999995E-7,-2.5199999999999999E-5,-1.24E-3,1.04,null,null,-1.7000000000000001E-2,32.725000000000001]
["V13-C","35E","C",2000,"BXRE",{"$f":"MasterTable[[#This Row],[Product Family]]&\"-\"&MasterTable[[#This Row],[CCT/CRI]]","v":"V13-C-35E"},{"$f":"MasterTable[[#This Row],[Generation]]&\"-\"&MasterTable[[#This Row],[CCT/CRI]]&IF(MasterTable[[#This Row],[Lumen Family]]<999,\"0\"&MasterTable[[#This Row],[Lumen Family]],MasterTable[[#This Row],[Lumen Family]])&\"-\"&MasterTable[[#This Row],[Arrangement]]&\"-2x\"","v":"BXRE-35E2000-C-2x"},2150,0.22,32.299999999999997,500,1050,33,-9.5076604018999997E-12,2.4428286607E-8,-2.3169246580000001E-5,1.4970494217E-2,28.116669275,null,-5.2056577008E-7,2.2529763468E-3,4.8311928226E-3,null,-4.9200361948999999E-7,2.2350279158000002E-3,6.8891795015E-3,-3.29E-9,5.2499999999999995E-7,-2.5199999999999999E-5,-1.24E-3,1.04,null,null,-1.7000000000000001E-2,32.725000000000001]
["V13-C","35G","C",2000,"BXRE",{"$f":"MasterTable[[#This Row],[Product Family]]&\"-\"&MasterTable[[#This Row],[CCT/CRI]]","v":"V13-C-35G"},{"$f":"MasterTable[[#This Row],[Generation]]&\"-\"&MasterTable[[#This Row],[CCT/CRI]]&IF(MasterTable[[#This Row],[Lumen Family]]<999,\"0\"&MasterTable[[#This Row],[Lumen Family]],MasterTable[[#This Row],[Lumen Family]])&\"-\"&MasterTable[[#This Row],[Arrangement]]&\"-2x\"","v":"BXRE-35G2000-C-2x"},1841,0.22,32.299999999999997,500,1050,33,-9.5076604018999997E-12,2.4428286607E-8,-2.3169246580000001E-5,1.4970494217E-2,28.116669275,null,-5.2056577008E-7,2.2529763468E-3,4.8311928226E-3,null,-4.9200361948999999E-7,2.2350279158000002E-3,6.8891795015E-3,-3.29E-9,5.2499999999999995E-7,-2.5199999999999999E-5,-1.24E-3,1.04,null,null,-1.7000000000000001E-2,32.725000000000001]
["V13-C","40E","C",2000,"BXRE",{"$f":"MasterTable[[#This Row],[Product Family]]&\"-\"&MasterTable[[#This Row],[CCT/CRI]]","v":"V13-C-40E"},{"$f":"MasterTable[[#This Row],[Generation]]&\"-\"&MasterTable[[#This Row],[CCT/CRI]]&IF(MasterTable[[#This Row],[Lumen Family]]<999,\"0\"&MasterTable[[#This Row],[Lumen Family]],MasterTable[[#This Row],[Lumen Family]])&\"-\"&MasterTable[[#This Row],[Arrangement]]&\"-2x\"","v":"BXRE-40E2000-C-2x"},2213,0.22,32.299999999999997,500,1050,33,-9.5076604018999997E-12,2.4428286607E-8,-2.3169246580000001E-5,1.4970494217E-2,28.116669275,null,-5.2056577008E-7,2.2529763468E-3,4.8311928226E-3,null,-4.9200361948999999E-7,2.2350279158000002E-3,6.8891795015E-3,null,-1.02E-7,1.27E-5,-2.0200000000000001E-3,1.04,null,null,-1.7000000000000001E-2,32.725000000000001]
["V13-C","40G","C",2000,"BXRE",{"$f":"MasterTable[[#This Row],[Product Family]]&\"-\"&MasterTable[[#This Row],[CCT/CRI]]","v":"V13-C-40G"},{"$f":"MasterTable[[#This Row],[Generation]]&\"-\"&MasterTable[[#This Row],[CCT/CRI]]&IF(MasterTable[[#This Row],[Lumen Family]]<999,\"0\"&MasterTable[[#This Row],[Lumen Family]],MasterTable[[#This Row],[Lumen Family]])&\"-\"&MasterTable[[#This Row],[Arrangement]]&\"-2x\"","v":"BXRE-40G2000-C-2x"},1900,0.22,32.299999999999997,500,1050,33,-9.5076604018999997E-12,2.4428286607E-8,-2.3169246580000001E-5,1.4970494217E-2,28.116669275,null,-5.2056577008E-7,2.2529763468E-3,4.8311928226E-3,null,-4.9200361948999999E-7,2.2350279158000002E-3,6.8891795015E-3,null,-1.02E-7,1.27E-5,-2.0200000000000001E-3,1.04,null,null,-1.7000000000000001E-2,32.725000000000001]
["V13-C","50C","C",2000,"BXRE",{"$f":"MasterTable[[#This Row],[Product Family]]&\"-\"&MasterTable[[#This Row],[CCT/CRI]]","v":"V13-C-50C"},{"$f":"MasterTable[[#This Row],[Generation]]&\"-\"&MasterTable[[#This Row],[CCT/CRI]]&IF(MasterTable[[#This Row],[Lumen Family]]<999,\"0\"&MasterTable[[#This Row],[Lumen Family]],MasterTable[[#This Row],[Lumen Family]])&\"-\"&MasterTable[[#This Row],[Arrangement]]&\"-2x\"","v":"BXRE-50C2000-C-2x"},2342,0.22,32.299999999999997,500,1050,33,-9.5076604018999997E-12,2.4428286607E-8,-2.3169246580000001E-5,1.4970494217E-2,28.116669275,null,-5.2056577008E-7,2.2529763468E-3,4.8311928226E-3,null,-4.9200361948999999E-7,2.2350279158000002E-3,6.8891795015E-3,null,null,-3.9999999999999998E-6,-1.6000000000000001E-3,1.0421,null,null,-1.7000000000000001E-2,32.725000000000001]
["V13-C","50E","C",2000,"BXRE",{"$f":"MasterTable[[#This Row],[Product Family]]&\"-\"&MasterTable[[#This Row],[CCT/CRI]]","v":"V13-C-50E"},{"$f":"MasterTable[[#This Row],[Generation]]&\"-\"&MasterTable[[#This Row],[CCT/CRI]]&IF(MasterTable[[#This Row],[Lumen Family]]<999,\"0\"&MasterTable[[#This Row],[Lumen Family]],MasterTable[[#This Row],[Lumen Family]])&\"-\"&MasterTable[[#This Row],[Arrangement]]&\"-2x\"","v":"BXRE-50E2000-C-2x"},2245,0.22,32.299999999999997,500,1050,33,-9.5076604018999997E-12,2.4428286607E-8,-2.3169246580000001E-5,1.4970494217E-2,28.116669275,null,-5.2056577008E-7,2.2529763468E-3,4.8311928226E-3,null,-4.9200361948999999E-7,2.2350279158000002E-3,6.8891795015E-3,null,null,-3.9999999999999998E-6,-1.6000000000000001E-3,1.0421,null,null,-1.7000000000000001E-2,32.725000000000001]
["V13-C","50G","C",2000,"BXRE",{"$f":"MasterTable[[#This Row],[Product Family]]&\"-\"&MasterTable[[#This Row],[CCT/CRI]]","v":"V13-C-50G"},{"$f":"MasterTable[[#This Row],[Generation]]&\"-\"&MasterTable[[#This Row],[CCT/CRI]]&IF(MasterTable[[#This Row],[Lumen Family]]<999,\"0\"&MasterTable[[#This Row],[Lumen Family]],MasterTable[[#This Row],[Lumen Family]])&\"-\"&MasterTable[[#This Row],[Arrangement]]&\"-2x\"","v":"BXRE-50G2000-C-2x"},2015,0.22,32.299999999999997,500,1050,33,-9.5076604018999997E-12,2.4428286607E-8,-2.3169246580000001E-5,1.4970494217E-2,28.116669275,null,-5.2056577008E-7,2.2529763468E-3,4.8311928226E-3,null,-4.9200361948999999E-7,2.2350279158000002E-3,6.8891795015E-3,null,null,-3.9999999999999998E-6,-1.6000000000000001E-3,1.0421,null,null,-1.7000000000000001E-2,32.725000000000001]
["V15-DL","27E","D",3001,"BXRE",{"$f":"MasterTable[[#This Row],[Product Family]]&\"-\"&MasterTable[[#This Row],[CCT/CRI]]","v":"V15-DL-27E"},{"$f":"MasterTable[[#This Row],[Generation]]&\"-\"&MasterTable[[#This Row],[CCT/CRI]]&IF(MasterTable[[#This Row],[Lumen Family]]<999,\"0\"&MasterTable[[#This Row],[Lumen Family]],MasterTable[[#This Row],[Lumen Family]])&\"-\"&MasterTable[[#This Row],[Arrangement]]&\"-2x\"","v":"BXRE-27E3001-D-2x"},2994,0.16,36,700,1400,48,-2.6999999999999998E-12,9.5399999999999997E-9,-1.2500000000000001E-5,1.1900000000000001E-2,31.2,null,-2.826E-7,1.6303876000000001E-3,0,null,-2.4830000000000002E-7,1.4695572999999999E-3,0,null,null,-7.4085999999999997E-6,-9.4322310000000001E-4,1.0274101318,null,null,-1.7000000000000001E-2,36.424999999999997]
["V15-DL","27G","D",3001,"BXRE",{"$f":"MasterTable[[#This Row],[Product Family]]&\"-\"&MasterTable[[#This Row],[CCT/CRI]]","v":"V15-DL-27G"},{"$f":"MasterTable[[#This Row],[Generation]]&\"-\"&MasterTable[[#This Row],[CCT/CRI]]&IF(MasterTable[[#This Row],[Lumen Family]]<999,\"0\"&MasterTable[[#This Row],[Lumen Family]],MasterTable[[#This Row],[Lumen Family]])&\"-\"&MasterTable[[#This Row],[Arrangement]]&\"-2x\"","v":"BXRE-27G3001-D-2x"},2520,0.16,36,700,1400,48,-2.6999999999999998E-12,9.5399999999999997E-9,-1.2500000000000001E-5,1.1900000000000001E-2,31.2,null,-2.826E-7,1.6303876000000001E-3,0,null,-2.4830000000000002E-7,1.4695572999999999E-3,0,null,null,-7.4085999999999997E-6,-9.4322310000000001E-4,1.0274101318,null,null,-1.7000000000000001E-2,36.424999999999997]
["V15-DL","30E","D",3001,"BXRE",{"$f":"MasterTable[[#This Row],[Product Family]]&\"-\"&MasterTable[[#This Row],[CCT/CRI]]","v":"V15-DL-30E"},{"$f":"MasterTable[[#This Row],[Generation]]&\"-\"&MasterTable[[#This Row],[CCT/CRI]]&IF(MasterTable[[#This Row],[Lumen Family]]<999,\"0\"&MasterTable[[#This Row],[Lumen Family]],MasterTable[[#This Row],[Lumen Family]])&\"-\"&MasterTable[[#This Row],[Arrangement]]&\"-2x\"","v":"BXRE-30E3001-D-2x"},3178,0.16,36,700,1400,48,-2.6999999999999998E-12,9.5399999999999997E-9,-1.2500000000000001E-5,1.1900000000000001E-2,31.2,null,-2.826E-7,1.6303876000000001E-3,0,null,-2.4830000000000002E-7,1.4695572999999999E-3,0,null,null,-7.4085999999999997E-6,-9.4322310000000001E-4,1.0274101318,null,null,-1.7000000000000001E-2,36.424999999999997]
["V15-DL","30G","D",3001,"BXRE",{"$f":"MasterTable[[#This Row],[Product Family]]&\"-\"&MasterTable[[#This Row],[CCT/CRI]]","v":"V15-DL-30G"},{"$f":"MasterTable[[#This Row],[Generation]]&\"-\"&MasterTable[[#This Row],[CCT/CRI]]&IF(MasterTable[[#This Row],[Lumen Family]]<999,\"0\"&MasterTable[[#This Row],[Lumen Family]],MasterTable[[#This Row],[Lumen Family]])&\"-\"&MasterTable[[#This Row],[Arrangement]]&\"-2x\"","v":"BXRE-30G3001-D-2x"},2596,0.16,36,700,1400,48,-2.6999999999999998E-12,9.5399999999999997E-9,-1.2500000000000001E-5,1.1900000000000001E-2,31.2,null,-2.826E-7,1.6303876000000001E-3,0,null,-2.4830000000000002E-7,1.4695572999999999E-3,0,null,null,-7.4085999999999997E-6,-9.4322310000000001E-4,1.0274101318,null,null,-1.7000000000000001E-2,36.424999999999997]
["V15-DL","35E","D",3001,"BXRE",{"$f":"MasterTable[[#This Row],[Product Family]]&\"-\"&MasterTable[[#This Row],[CCT/CRI]]","v":"V15-DL-35E"},{"$f":"MasterTable[[#This Row],[Generation]]&\"-\"&MasterTable[[#This Row],[CCT/CRI]]&IF(MasterTable[[#This Row],[Lumen Family]]<999,\"0\"&MasterTable[[#This Row],[Lumen Family]],MasterTable[[#This Row],[Lumen Family]])&\"-\"&MasterTable[[#This Row],[Arrangement]]&\"-2x\"","v":"BXRE-35E3001-D-2x"},3284,0.16,36,700,1400,48,-2.6999999999999998E-12,9.5399999999999997E-9,-1.2500000000000001E-5,1.1900000000000001E-2,31.2,null,-2.826E-7,1.6303876000000001E-3,0,null,-2.4830000000000002E-7,1.4695572999999999E-3,0,null,null,-7.4085999999999997E-6,-9.4322310000000001E-4,1.0274101318,null,null,-1.7000000000000001E-2,36.424999999999997]
["V15-DL","35G","D",3001,"BXRE",{"$f":"MasterTable[[#This Row],[Product Family]]&\"-\"&MasterTable[[#This Row],[CCT/CRI]]","v":"V15-DL-35G"},{"$f":"MasterTable[[#This Row],[Generation]]&\"-\"&MasterTable[[#This Row],[CCT/CRI]]&IF(MasterTable[[#This Row],[Lumen Family]]<999,\"0\"&MasterTable[[#This Row],[Lumen Family]],MasterTable[[#This Row],[Lumen Family]])&\"-\"&MasterTable[[#This Row],[Arrangement]]&\"-2x\"","v":"BXRE-35G3001-D-2x"},2671,0.16,36,700,1400,48,-2.6999999999999998E-12,9.5399999999999997E-9,-1.2500000000000001E-5,1.1900000000000001E-2,31.2,null,-2.826E-7,1.6303876000000001E-3,0,null,-2.4830000000000002E-7,1.4695572999999999E-3,0,null,null,-7.4085999999999997E-6,-9.4322310000000001E-4,1.0274101318,null,null,-1.7000000000000001E-2,36.424999999999997]
["V15-DL","40E","D",3001,"BXRE",{"$f":"MasterTable[[#This Row],[Product Family]]&\"-\"&MasterTable[[#This Row],[CCT/CRI]]","v":"V15-DL-40E"},{"$f":"MasterTable[[#This Row],[Generation]]&\"-\"&MasterTable[[#This Row],[CCT/CRI]]&IF(MasterTable[[#This Row],[Lumen Family]]<999,\"0\"&MasterTable[[#This Row],[Lumen Family]],MasterTable[[#This Row],[Lumen Family]])&\"-\"&MasterTable[[#This Row],[Arrangement]]&\"-2x\"","v":"BXRE-40E3001-D-2x"},3350,0.16,36,700,1400,48,-2.6999999999999998E-12,9.5399999999999997E-9,-1.2500000000000001E-5,1.1900000000000001E-2,31.2,null,-2.826E-7,1.6303876000000001E-3,0,null,-2.4830000000000002E-7,1.4695572999999999E-3,0,null,null,-5.2610000000000001E-6,-1.1508107E-3,1.0294046488999999,null,null,-1.7000000000000001E-2,36.424999999999997]
["V15-DL","40G","D",3001,"BXRE",{"$f":"MasterTable[[#This Row],[Product Family]]&\"-\"&MasterTable[[#This Row],[CCT/CRI]]","v":"V15-DL-40G"},{"$f":"MasterTable[[#This Row],[Generation]]&\"-\"&MasterTable[[#This Row],[CCT/CRI]]&IF(MasterTable[[#This Row],[Lumen Family]]<999,\"0\"&MasterTable[[#This Row],[Lumen Family]],MasterTable[[#This Row],[Lumen Family]])&\"-\"&MasterTable[[#This Row],[Arrangement]]&\"-2x\"","v":"BXRE-40G3001-D-2x"},2822,0.16,36,700,1400,48,-2.6999999999999998E-12,9.5399999999999997E-9,-1.2500000000000001E-5,1.1900000000000001E-2,31.2,null,-2.826E-7,1.6303876000000001E-3,0,null,-2.4830000000000002E-7,1.4695572999999999E-3,0,null,null,-5.2610000000000001E-6,-1.1508107E-3,1.0294046488999999,null,null,-1.7000000000000001E-2,36.424999999999997]
["V15-DL","50C","D",3001,"BXRE",{"$f":"MasterTable[[#This Row],[Product Family]]&\"-\"&MasterTable[[#This Row],[CCT/CRI]]","v":"V15-DL-50C"},{"$f":"MasterTable[[#This Row],[Generation]]&\"-\"&MasterTable[[#This Row],[CCT/CRI]]&IF(MasterTable[[#This Row],[Lumen Family]]<999,\"0\"&MasterTable[[#This Row],[Lumen Family]],MasterTable[[#This Row],[Lumen Family]])&\"-\"&MasterTable[[#This Row],[Arrangement]]&\"-2x\"","v":"BXRE-50C3001-D-2x"},3654,0.16,36,700,1400,48,-2.6999999999999998E-12,9.5399999999999997E-9,-1.2500000000000001E-5,1.1900000000000001E-2,31.2,null,-2.826E-7,1.6303876000000001E-3,0,null,-2.4830000000000002E-7,1.4695572999999999E-3,0,null,null,-3.0728E-6,-1.8775262999999999E-3,1.0490946606,null,null,-1.7000000000000001E-2,36.424999999999997]
["V15-DL","50E","D",3001,"BXRE",{"$f":"MasterTable[[#This Row],[Product Family]]&\"-\"&MasterTable[[#This Row],[CCT/CRI]]","v":"V15-DL-50E"},{"$f":"MasterTable[[#This Row],[Generation]]&\"-\"&MasterTable[[#This Row],[CCT/CRI]]&IF(MasterTable[[#This Row],[Lumen Family]]<999,\"0\"&MasterTable[[#This Row],[Lumen Family]],MasterTable[[#This Row],[Lumen Family]])&\"-\"&MasterTable[[#This Row],[Arrangement]]&\"-2x\"","v":"BXRE-50E3001-D-2x"},3260,0.16,36,700,1400,48,-2.6999999999999998E-12,9.5399999999999997E-9,-1.2500000000000001E-5,1.1900000000000001E-2,31.2,null,-2.826E-7,1.6303876000000001E-3,0,null,-2.4830000000000002E-7,1.4695572999999999E-3,0,null,null,-3.0728E-6,-1.8775262999999999E-3,1.0490946606,null,null,-1.7000000000000001E-2,36.424999999999997]
["V15-DL","50G","D",3001,"BXRE",{"$f":"MasterTable[[#This Row],[Product Family]]&\"-\"&MasterTable[[#This Row],[CCT/CRI]]","v":"V15-DL-50G"},{"$f":"MasterTable[[#This Row],[Generation]]&\"-\"&MasterTable[[#This Row],[CCT/CRI]]&IF(MasterTable[[#This Row],[Lumen Family]]<999,\"0\"&MasterTable[[#This Row],[Lumen Family]],MasterTable[[#This Row],[Lumen Family]])&\"-\"&MasterTable[[#This Row],[Arrangement]]&\"-2x\"","v":"BXRE-50G3001-D-2x"},2898,0.16,36,700,1400,48,-2.6999999999999998E-12,9.5399999999999997E-9,-1.2500000000000001E-5,1.1900000000000001E-2,31.2,null,-2.826E-7,1.6303876000000001E-3,0,null,-2.4830000000000002E-7,1.4695572999999999E-3,0,null,null,-3.0728E-6,-1.8775262999999999E-3,1.0490946606,null,null,-1.7000000000000001E-2,36.424999999999997]
["V18-F","27E","F",4000,"BXRE",{"$f":"MasterTable[[#This Row],[Product Family]]&\"-\"&MasterTable[[#This Row],[CCT/CRI]]","v":"V18-F-27E"},{"$f":"MasterTable[[#This Row],[Generation]]&\"-\"&MasterTable[[#This Row],[CCT/CRI]]&IF(MasterTable[[#This Row],[Lumen Family]]<999,\"0\"&MasterTable[[#This Row],[Lumen Family]],MasterTable[[#This Row],[Lumen Family]])&\"-\"&MasterTable[[#This Row],[Arrangement]]&\"-2x\"","v":"BXRE-27E4000-F-2x"},3872,0.13,29.5,1050,2100,60,-4.3296141676000001E-13,2.4210131023999999E-9,-5.0293161703999997E-6,6.8884526139999999E-3,25.523184017999998,null,-1.3106025059999999E-7,1.0878699984E-3,4.2883455537999996E-3,null,-1.211637044E-7,1.0744689300000001E-3,6.8809729823E-3,6.6426899999999999E-9,-1.4332000000000001E-6,1.01154E-4,-4.1218399999999999E-3,1.0607,null,null,-1.4999999999999999E-2,29.875]
["V18-F","27G","F",4000,"BXRE",{"$f":"MasterTable[[#This Row],[Product Family]]&\"-\"&MasterTable[[#This Row],[CCT/CRI]]","v":"V18-F-27G"},{"$f":"MasterTable[[#This Row],[Generation]]&\"-\"&MasterTable[[#This Row],[CCT/CRI]]&IF(MasterTable[[#This Row],[Lumen Family]]<999,\"0\"&MasterTable[[#This Row],[Lumen Family]],MasterTable[[#This Row],[Lumen Family]])&\"-\"&MasterTable[[#This Row],[Arrangement]]&\"-2x\"","v":"BXRE-27G4000-F-2x"},3221,0.13,29.5,1050,2100,60,-4.3296141676000001E-13,2.4210131023999999E-9,-5.0293161703999997E-6,6.8884526139999999E-3,25.523184017999998,null,-1.3106025059999999E-7,1.0878699984E-3,4.2883455537999996E-3,null,-1.211637044E-7,1.0744689300000001E-3,6.8809729823E-3,6.6426899999999999E-9,-1.4332000000000001E-6,1.01154E-4,-4.1218399999999999E-3,1.0607,null,null,-1.4999999999999999E-2,29.875]
["V18-F","30E","F",4000,"BXRE",{"$f":"MasterTable[[#This Row],[Product Family]]&\"-\"&MasterTable[[#This Row],[CCT/CRI]]","v":"V18-F-30E"},{"$f":"MasterTable[[#This Row],[Generation]]&\"-\"&MasterTable[[#This Row],[CCT/CRI]]&IF(MasterTable[[#This Row],[Lumen Family]]<999,\"0\"&MasterTable[[#This Row],[Lumen Family]],MasterTable[[#This Row],[Lumen Family]])&\"-\"&MasterTable[[#This Row],[Arrangement]]&\"-2x\"","v":"BXRE-30E4000-F-2x"},4050,0.13,29.5,1050,2100,60,-4.3296141676000001E-13,2.4210131023999999E-9,-5.0293161703999997E-6,6.8884526139999999E-3,25.523184017999998,null,-1.3106025059999999E-7,1.0878699984E-3,4.2883455537999996E-3,null,-1.211637044E-7,1.0744689300000001E-3,6.8809729823E-3,6.6426899999999999E-9,-1.4332000000000001E-6,1.01154E-4,-4.1218399999999999E-3,1.0607,null,null,-1.4999999999999999E-2,29.875]
["V18-F","30G","F",4000,"BXRE",{"$f":"MasterTable[[#This Row],[Product Family]]&\"-\"&MasterTable[[#This Row],[CCT/CRI]]","v":"V18-F-30G"},{"$f":"MasterTable[[#This Row],[Generation]]&\"-\"&MasterTable[[#This Row],[CCT/CRI]]&IF(MasterTable[[#This Row],[Lumen Family]]<999,\"0\"&MasterTable[[#This Row],[Lumen Family]],MasterTable[[#This Row],[Lumen Family]])&\"-\"&MasterTable[[#This Row],[Arrangement]]&\"-2x\"","v":"BXRE-30G4000-F-2x"},3376,0.13,29.5,1050,2100,60,-4.3296141676000001E-13,2.4210131023999999E-9,-5.0293161703999997E-6,6.8884526139999999E-3,25.523184017999998,null,-1.3106025059999999E-7,1.0878699984E-3,4.2883455537999996E-3,null,-1.211637044E-7,1.0744689300000001E-3,6.8809729823E-3,6.6426899999999999E-9,-1.4332000000000001E-6,1.01154E-4,-4.1218399999999999E-3,1.0607,null,null,-1.4999999999999999E-2,29.875]
["V18-F","35E","F",4000,"BXRE",{"$f":"MasterTable[[#This Row],[Product Family]]&\"-\"&MasterTable[[#This Row],[CCT/CRI]]","v":"V18-F-35E"},{"$f":"MasterTable[[#This Row],[Generation]]&\"-\"&MasterTable[[#This Row],[CCT/CRI]]&IF(MasterTable[[#This Row],[Lumen Family]]<999,\"0\"&MasterTable[[#This Row],[Lumen Family]],MasterTable[[#This Row],[Lumen Family]])&\"-\"&MasterTable[[#This Row],[Arrangement]]&\"-2x\"","v":"BXRE-35E4000-F-2x"},4150,0.13,29.5,1050,2100,60,-4.3296141676000001E-13,2.4210131023999999E-9,-5.0293161703999997E-6,6.8884526139999999E-3,25.523184017999998,null,-1.3106025059999999E-7,1.0878699984E-3,4.2883455537999996E-3,null,-1.211637044E-7,1.0744689300000001E-3,6.8809729823E-3,6.6426899999999999E-9,-1.4332000000000001E-6,1.01154E-4,-4.1218399999999999E-3,1.0607,null,null,-1.4999999999999999E-2,29.875]
["V18-F","35G","F",4000,"BXRE",{"$f":"MasterTable[[#This Row],[Product Family]]&\"-\"&MasterTable[[#This Row],[CCT/CRI]]","v":"V18-F-35G"},{"$f":"MasterTable[[#This Row],[Generation]]&\"-\"&MasterTable[[#This Row],[CCT/CRI]]&IF(MasterTable[[#This Row],[Lumen Family]]<999,\"0\"&MasterTable[[#This Row],[Lumen Family]],MasterTable[[#This Row],[Lumen Family]])&\"-\"&MasterTable[[#This Row],[Arrangement]]&\"-2x\"","v":"BXRE-35G4000-F-2x"},3655,0.13,29.5,1050,2100,60,-4.3296141676000001E-13,2.4210131023999999E-9,-5.0293161703999997E-6,6.8884526139999999E-3,25.523184017999998,null,-1.3106025059999999E-7,1.0878699984E-3,4.2883455537999996E-3,null,-1.211637044E-7,1.0744689300000001E-3,6.8809729823E-3,6.6426899999999999E-9,-1.4332000000000001E-6,1.01154E-4,-4.1218399999999999E-3,1.0607,null,null,-1.4999999999999999E-2,29.875]
["V18-F","40E","F",4000,"BXRE",{"$f":"MasterTable[[#This Row],[Product Family]]&\"-\"&MasterTable[[#This Row],[CCT/CRI]]","v":"V18-F-40E"},{"$f":"MasterTable[[#This Row],[Generation]]&\"-\"&MasterTable[[#This Row],[CCT/CRI]]&IF(MasterTable[[#This Row],[Lumen Family]]<999,\"0\"&MasterTable[[#This Row],[Lumen Family]],MasterTable[[#This Row],[Lumen Family]])&\"-\"&MasterTable[[#This Row],[Arrangement]]&\"-2x\"","v":"BXRE-40E4000-F-2x"},4244,0.13,29.5,1050,2100,60,-4.3296141676000001E-13,2.4210131023999999E-9,-5.0293161703999997E-6,6.8884526139999999E-3,25.523184017999998,null,-1.3106025059999999E-7,1.0878699984E-3,4.2883455537999996E-3,null,-1.211637044E-7,1.0744689300000001E-3,6.8809729823E-3,null,-1.8425800000000001E-7,2.5068200000000002E-5,-2.5901499999999998E-3,1.05063,null,null,-1.4999999999999999E-2,29.875]
["V18-F","40G","F",4000,"BXRE",{"$f":"MasterTable[[#This Row],[Product Family]]&\"-\"&MasterTable[[#This Row],[CCT/CRI]]","v":"V18-F-40G"},{"$f":"MasterTable[[#This Row],[Generation]]&\"-\"&MasterTable[[#This Row],[CCT/CRI]]&IF(MasterTable[[#This Row],[Lumen Family]]<999,\"0\"&MasterTable[[#This Row],[Lumen Family]],MasterTable[[#This Row],[Lumen Family]])&\"-\"&MasterTable[[#This Row],[Arrangement]]&\"-2x\"","v":"BXRE-40G4000-F-2x"},3670,0.13,29.5,1050,2100,60,-4.3296141676000001E-13,2.4210131023999999E-9,-5.0293161703999997E-6,6.8884526139999999E-3,25.523184017999998,null,-1.3106025059999999E-7,1.0878699984E-3,4.2883455537999996E-3,null,-1.211637044E-7,1.0744689300000001E-3,6.8809729823E-3,null,-1.8425800000000001E-7,2.5068200000000002E-5,-2.5901499999999998E-3,1.05063,null,null,-1.4999999999999999E-2,29.875]
["V18-F","50C","F",4000,"BXRE",{"$f":"MasterTable[[#This Row],[Product Family]]&\"-\"&MasterTable[[#This Row],[CCT/CRI]]","v":"V18-F-50C"},{"$f":"MasterTable[[#This Row],[Generation]]&\"-\"&MasterTable[[#This Row],[CCT/CRI]]&IF(MasterTable[[#This Row],[Lumen Family]]<999,\"0\"&MasterTable[[#This Row],[Lumen Family]],MasterTable[[#This Row],[Lumen Family]])&\"-\"&MasterTable[[#This Row],[Arrangement]]&\"-2x\"","v":"BXRE-50C4000-F-2x"},4491,0.13,29.5,1050,2100,60,-4.3296141676000001E-13,2.4210131023999999E-9,-5.0293161703999997E-6,6.8884526139999999E-3,25.523184017999998,null,-1.3106025059999999E-7,1.0878699984E-3,4.2883455537999996E-3,null,-1.211637044E-7,1.0744689300000001E-3,6.8809729823E-3,null,null,-3.9999999999999998E-6,-1.6000000000000001E-3,1.0421,null,null,-1.4999999999999999E-2,29.875]
["V18-F","50E","F",4000,"BXRE",{"$f":"MasterTable[[#This Row],[Product Family]]&\"-\"&MasterTable[[#This Row],[CCT/CRI]]","v":"V18-F-50E"},{"$f":"MasterTable[[#This Row],[Generation]]&\"-\"&MasterTable[[#This Row],[CCT/CRI]]&IF(MasterTable[[#This Row],[Lumen Family]]<999,\"0\"&MasterTable[[#This Row],[Lumen Family]],MasterTable[[#This Row],[Lumen Family]])&\"-\"&MasterTable[[#This Row],[Arrangement]]&\"-2x\"","v":"BXRE-50E4000-F-2x"},4275,0.13,29.5,1050,2100,60,-4.3296141676000001E-13,2.4210131023999999E-9,-5.0293161703999997E-6,6.8884526139999999E-3,25.523184017999998,null,-1.3106025059999999E-7,1.0878699984E-3,4.2883455537999996E-3,null,-1.211637044E-7,1.0744689300000001E-3,6.8809729823E-3,null,null,-3.9999999999999998E-6,-1.6000000000000001E-3,1.0421,null,null,-1.4999999999999999E-2,29.875]
["V18-F","50G","F",4000,"BXRE",{"$f":"MasterTable[[#This Row],[Product Family]]&\"-\"&MasterTable[[#This Row],[CCT/CRI]]","v":"V18-F-50G"},{"$f":"MasterTable[[#This Row],[Generation]]&\"-\"&MasterTable[[#This Row],[CCT/CRI]]&IF(MasterTable[[#This Row],[Lumen Family]]<999,\"0\"&MasterTable[[#This Row],[Lumen Family]],MasterTable[[#This Row],[Lumen Family]])&\"-\"&MasterTable[[#This Row],[Arrangement]]&\"-2x\"","v":"BXRE-50G4000-F-2x"},3885,0.13,29.5,1050,2100,60,-4.3296141676000001E-13,2.4210131023999999E-9,-5.0293161703999997E-6,6.8884526139999999E-3,25.523184017999998,null,-1.3106025059999999E-7,1.0878699984E-3,4.2883455537999996E-3,null,-1.211637044E-7,1.0744689300000001E-3,6.8809729823E-3,null,null,-3.9999999999999998E-6,-1.6000000000000001E-3,1.0421,null,null,-1.4999999999999999E-2,29.875]
["V22-G","27E","G",6500,"BXRE",{"$f":"MasterTable[[#This Row],[Product Family]]&\"-\"&MasterTable[[#This Row],[CCT/CRI]]","v":"V22-G-27E"},{"$f":"MasterTable[[#This Row],[Generation]]&\"-\"&MasterTable[[#This Row],[CCT/CRI]]&IF(MasterTable[[#This Row],[Lumen Family]]<999,\"0\"&MasterTable[[#This Row],[Lumen Family]],MasterTable[[#This Row],[Lumen Family]])&\"-\"&MasterTable[[#This Row],[Arrangement]]&\"-2x\"","v":"BXRE-27E6500-G-2x"},6100,0.09,35.9,1400,2800,96,-4.7735290000000003E-14,3.9481665237999999E-10,-1.3789387698603999E-6,4.7821193397229603E-3,30.962957331869401,null,-4.6700000000000001E-8,7.7981120000000001E-4,7.0641762000000002E-3,null,-1.211637044E-7,1.0744689300000001E-3,6.8809729823E-3,null,null,-4.6531000000000004E-6,-1.0859076000000001E-3,1.0242398817,null,null,-0.02,36.4,null," "]
["V22-G","30E","G",6500,"BXRE",{"$f":"MasterTable[[#This Row],[Product Family]]&\"-\"&MasterTable[[#This Row],[CCT/CRI]]","v":"V22-G-30E"},{"$f":"MasterTable[[#This Row],[Generation]]&\"-\"&MasterTable[[#This Row],[CCT/CRI]]&IF(MasterTable[[#This Row],[Lumen Family]]<999,\"0\"&MasterTable[[#This Row],[Lumen Family]],MasterTable[[#This Row],[Lumen Family]])&\"-\"&MasterTable[[#This Row],[Arrangement]]&\"-2x\"","v":"BXRE-30E6500-G-2x"},6500,0.09,35.9,1400,2800,96,-4.7735290000000003E-14,3.9481665237999999E-10,-1.3789387698603999E-6,4.7821193397229603E-3,30.962957331869401,null,-4.6700000000000001E-8,7.7981120000000001E-4,7.0641762000000002E-3,null,-1.211637044E-7,1.0744689300000001E-3,6.8809729823E-3,null,null,-4.6531000000000004E-6,-1.0859076000000001E-3,1.0242398817,null,null,-0.02,36.4]
["V22-G","40E","G",6500,"BXRE",{"$f":"MasterTable[[#This Row],[Product Family]]&\"-\"&MasterTable[[#This Row],[CCT/CRI]]","v":"V22-G-40E"},{"$f":"MasterTable[[#This Row],[Generation]]&\"-\"&MasterTable[[#This Row],[CCT/CRI]]&IF(MasterTable[[#This Row],[Lumen Family]]<999,\"0\"&MasterTable[[#This Row],[Lumen Family]],MasterTable[[#This Row],[Lumen Family]])&\"-\"&MasterTable[[#This Row],[Arrangement]]&\"-2x\"","v":"BXRE-40E6500-G-2x"},7000,0.09,35.9,1400,2800,96,-4.7735290000000003E-14,3.9481665237999999E-10,-1.3789387698603999E-6,4.7821193397229603E-3,30.962957331869401,null,-4.6700000000000001E-8,7.7981120000000001E-4,7.0641762000000002E-3,null,-1.211637044E-7,1.0744689300000001E-3,6.8809729823E-3,null,null,-5.6486999999999998E-6,-1.0440245999999999E-3,1.0197192691000001,null,null,-0.02,36.4]
["V22-G","50C","G",6500,"BXRE",{"$f":"MasterTable[[#This Row],[Product Family]]&\"-\"&MasterTable[[#This Row],[CCT/CRI]]","v":"V22-G-50C"},{"$f":"MasterTable[[#This Row],[Generation]]&\"-\"&MasterTable[[#This Row],[CCT/CRI]]&IF(MasterTable[[#This Row],[Lumen Family]]<999,\"0\"&MasterTable[[#This Row],[Lumen Family]],MasterTable[[#This Row],[Lumen Family]])&\"-\"&MasterTable[[#This Row],[Arrangement]]&\"-2x\"","v":"BXRE-50C6500-G-2x"},7400,0.09,35.9,1400,2800,96,-4.7735290000000003E-14,3.9481665237999999E-10,-1.3789387698603999E-6,4.7821193397229603E-3,30.962957331869401,null,-4.6700000000000001E-8,7.7981120000000001E-4,7.0641762000000002E-3,null,-1.211637044E-7,1.0744689300000001E-3,6.8809729823E-3,null,null,-6.9964999999999998E-6,-9.6038639999999995E-4,1.0155640958000001,null,null,-0.02,36.4]
["Vero 10","27E","B",1000,"BXRC",{"$f":"MasterTable[[#This Row],[Product Family]]&\"-\"&MasterTable[[#This Row],[CCT/CRI]]&MasterTable[[#This Row],[Arrangement]]","v":"Vero 10-27EB"},{"$f":"MasterTable[[#This Row],[Generation]]&\"-\"&MasterTable[[#This Row],[CCT/CRI]]&IF(MasterTable[[#This Row],[Lumen Family]]<999,\"0\"&MasterTable[[#This Row],[Lumen Family]],MasterTable[[#This Row],[Lumen Family]])&\"-\"&MasterTable[[#This Row],[Arrangement]]&\"-2x\"","v":"BXRC-27E1000-B-2x"},1150,0.47,26.5,350,700,12,-3.2099999999999998E-11,5.4800000000000001E-8,-3.5200000000000002E-5,1.78E-2,22.7,null,-9.0240000000000003E-7,3.1841790000000001E-3,0,null,-9.8919999999999999E-7,2.9291147999999999E-3,0,null,null,-5.9658999999999999E-6,-1.1600921E-3,1.0310375762999999,null,null,-1.4E-2,26.85]
["Vero 10","27G","B",1000,"BXRC",{"$f":"MasterTable[[#This Row],[Product Family]]&\"-\"&MasterTable[[#This Row],[CCT/CRI]]&MasterTable[[#This Row],[Arrangement]]","v":"Vero 10-27GB"},{"$f":"MasterTable[[#This Row],[Generation]]&\"-\"&MasterTable[[#This Row],[CCT/CRI]]&IF(MasterTable[[#This Row],[Lumen Family]]<999,\"0\"&MasterTable[[#This Row],[Lumen Family]],MasterTable[[#This Row],[Lumen Family]])&\"-\"&MasterTable[[#This Row],[Arrangement]]&\"-2x\"","v":"BXRC-27G1000-B-2x"},965,0.47,26.5,350,700,12,-3.2099999999999998E-11,5.4800000000000001E-8,-3.5200000000000002E-5,1.78E-2,22.7,null,-9.0240000000000003E-7,3.1841790000000001E-3,0,null,-9.8919999999999999E-7,2.9291147999999999E-3,0,null,null,-5.9658999999999999E-6,-1.1600921E-3,1.0310375762999999,null,null,-1.4E-2,26.85]
["Vero 10","27H","B",1000,"BXRC",{"$f":"MasterTable[[#This Row],[Product Family]]&\"-\"&MasterTable[[#This Row],[CCT/CRI]]&MasterTable[[#This Row],[Arrangement]]","v":"Vero 10-27HB"},{"$f":"MasterTable[[#This Row],[Generation]]&\"-\"&MasterTable[[#This Row],[CCT/CRI]]&IF(MasterTable[[#This Row],[Lumen Family]]<999,\"0\"&MasterTable[[#This Row],[Lumen Family]],MasterTable[[#This Row],[Lumen Family]])&\"-\"&MasterTable[[#This Row],[Arrangement]]&\"-xx\"","v":"BXRC-27H1000-B-xx"},766,0.47,26.5,350,700,12,-3.2099999999999998E-11,5.4800000000000001E-8,-3.5200000000000002E-5,1.78E-2,22.7,null,-9.2470000000000002E-7,3.1667774000000001E-3,4.1306240000000003E-3,null,-9.8919999999999999E-7,2.9291147999999999E-3,0,null,null,-5.8794E-6,-2.0447553000000002E-3,1.0419634254000001,null,null,-1.0999999999999999E-2,26.774999999999999]
["Vero 10","30A","B",1001,"BXRC",{"$f":"MasterTable[[#This Row],[Product Family]]&\"-\"&MasterTable[[#This Row],[CCT/CRI]]&MasterTable[[#This Row],[Arrangement]]","v":"Vero 10-30AB"},{"$f":"MasterTable[[#This Row],[Generation]]&\"-\"&MasterTable[[#This Row],[CCT/CRI]]&IF(MasterTable[[#This Row],[Lumen Family]]<999,\"0\"&MasterTable[[#This Row],[Lumen Family]],MasterTable[[#This Row],[Lumen Family]])&\"-\"&MasterTable[[#This Row],[Arrangement]]&\"-23\"","v":"BXRC-30A1001-B-23"},820,0.47,26.5,350,{"$f":"INDEX(FF_stats31333[],MATCH(A166,FF_stats31333[Form Factor],0),2)","v":700},12,-2.96E-11,5.4100000000000001E-8,-3.7200000000000003E-5,1.8700000000000001E-2,22.6,null,-9.4669999999999997E-7,3.1961206E-3,0,null,-9.6720000000000003E-7,2.8497370999999998E-3,0,null,null,-3.1489E-6,-1.5189406000000001E-3,1.0390016870000001,null,null,-1.4E-2,26.85]
["Vero 10","30E","B",1000,"BXRC",{"$f":"MasterTable[[#This Row],[Product Family]]&\"-\"&MasterTable[[#This Row],[CCT/CRI]]&MasterTable[[#This Row],[Arrangement]]","v":"Vero 10-30EB"},{"$f":"MasterTable[[#This Row],[Generation]]&\"-\"&MasterTable[[#This Row],[CCT/CRI]]&IF(MasterTable[[#This Row],[Lumen Family]]<999,\"0\"&MasterTable[[#This Row],[Lumen Family]],MasterTable[[#This Row],[Lumen Family]])&\"-\"&MasterTable[[#This Row],[Arrangement]]&\"-2x\"","v":"BXRC-30E1000-B-2x"},1207,0.47,26.5,350,700,12,-3.2099999999999998E-11,5.4800000000000001E-8,-3.5200000000000002E-5,1.78E-2,22.7,null,-9.0240000000000003E-7,3.1841790000000001E-3,0,null,-9.8919999999999999E-7,2.9291147999999999E-3,0,null,null,-5.9658999999999999E-6,-1.1600921E-3,1.0310375762999999,null,null,-1.4E-2,26.85]
["Vero 10","30G","B",1000,"BXRC",{"$f":"MasterTable[[#This Row],[Product Family]]&\"-\"&MasterTable[[#This Row],[CCT/CRI]]&MasterTable[[#This Row],[Arrangement]]","v":"Vero 10-30GB"},{"$f":"MasterTable[[#This Row],[Generation]]&\"-\"&MasterTable[[#This Row],[CCT/CRI]]&IF(MasterTable[[#This Row],[Lumen Family]]<999,\"0\"&MasterTable[[#This Row],[Lumen Family]],MasterTable[[#This Row],[Lumen Family]])&\"-\"&MasterTable[[#This Row],[Arrangement]]&\"-2x\"","v":"BXRC-30G1000-B-2x"},1002,0.47,26.5,350,700,12,-3.2099999999999998E-11,5.4800000000000001E-8,-3.5200000000000002E-5,1.78E-2,22.7,null,-9.0240000000000003E-7,3.1841790000000001E-3,0,null,-9.8919999999999999E-7,2.9291147999999999E-3,0,null,null,-5.9658999999999999E-6,-1.1600921E-3,1.0310375762999999,null,null,-1.4E-2,26.85]
["Vero 10","30H","B",1000,"BXRC",{"$f":"MasterTable[[#This Row],[Product Family]]&\"-\"&MasterTable[[#This Row],[CCT/CRI]]&MasterTable[[#This Row],[Arrangement]]","v":"Vero 10-30HB"},{"$f":"MasterTable[[#This Row],[Generation]]&\"-\"&MasterTable[[#This Row],[CCT/CRI]]&IF(MasterTable[[#This Row],[Lumen Family]]<999,\"0\"&MasterTable[[#This Row],[Lumen Family]],MasterTable[[#This Row],[Lumen Family]])&\"-\"&MasterTable[[#This Row],[Arrangement]]&\"-xx\"","v":"BXRC-30H1000-B-xx"},799,0.47,26.5,350,700,12,-3.2099999999999998E-11,5.4800000000000001E-8,-3.5200000000000002E-5,1.78E-2,22.7,null,-9.2470000000000002E-7,3.1667774000000001E-3,4.1306240000000003E-3,null,-9.8919999999999999E-7,2.9291147999999999E-3,0,null,null,-6.8209000000000002E-6,-1.7597718999999999E-3,1.0364359527,null,null,-1.0999999999999999E-2,26.774999999999999]
["Vero 10","35A","B",1000,"BXRC",{"$f":"MasterTable[[#This Row],[Product Family]]&\"-\"&MasterTable[[#This Row],[CCT/CRI]]&MasterTable[[#This Row],[Arrangement]]","v":"Vero 10-35AB"},{"$f":"MasterTable[[#This Row],[Generation]]&\"-\"&MasterTable[[#This Row],[CCT/CRI]]&IF(MasterTable[[#This Row],[Lumen Family]]<999,\"0\"&MasterTable[[#This Row],[Lumen Family]],MasterTable[[#This Row],[Lumen Family]])&\"-\"&MasterTable[[#This Row],[Arrangement]]&\"-23\"","v":"BXRC-35A1000-B-23"},909,0.47,26.5,350,700,12,-2.96E-11,5.4100000000000001E-8,-3.7200000000000003E-5,1.8700000000000001E-2,22.6,null,-9.4669999999999997E-7,3.1961206E-3,0,null,-9.8919999999999999E-7,2.9291147999999999E-3,0,null,null,-3.1489E-6,-1.5189406000000001E-3,1.0390016870000001,null,null,-1.4E-2,26.85]
["Vero 10","35E","B",1000,"BXRC",{"$f":"MasterTable[[#This Row],[Product Family]]&\"-\"&MasterTable[[#This Row],[CCT/CRI]]&MasterTable[[#This Row],[Arrangement]]","v":"Vero 10-35EB"},{"$f":"MasterTable[[#This Row],[Generation]]&\"-\"&MasterTable[[#This Row],[CCT/CRI]]&IF(MasterTable[[#This Row],[Lumen Family]]<999,\"0\"&MasterTable[[#This Row],[Lumen Family]],MasterTable[[#This Row],[Lumen Family]])&\"-\"&MasterTable[[#This Row],[Arrangement]]&\"-23\"","v":"BXRC-35E1000-B-23"},1208,0.47,26.5,350,700,12,-2.7683558559999999E-11,4.9921200010000003E-8,-3.3666763499999998E-5,1.5758188369999999E-2,23.37884141,null,-7.50847E-7,3.0730200000000001E-3,1.6631300000000002E-2,null,-9.8919999999999999E-7,2.9291147999999999E-3,0,null,null,-6.5181000000000003E-6,-1.0794369999999999E-3,1.0281727780000001,null,null,-1.0999999999999999E-2,26.774999999999999]
["Vero 10","35G","B",1000,"BXRC",{"$f":"MasterTable[[#This Row],[Product Family]]&\"-\"&MasterTable[[#This Row],[CCT/CRI]]&MasterTable[[#This Row],[Arrangement]]","v":"Vero 10-35GB"},{"$f":"MasterTable[[#This Row],[Generation]]&\"-\"&MasterTable[[#This Row],[CCT/CRI]]&IF(MasterTable[[#This Row],[Lumen Family]]<999,\"0\"&MasterTable[[#This Row],[Lumen Family]],MasterTable[[#This Row],[Lumen Family]])&\"-\"&MasterTable[[#This Row],[Arrangement]]&\"-23\"","v":"BXRC-35G1000-B-23"},1048,0.47,26.5,350,700,12,-2.7683558559999999E-11,4.9921200010000003E-8,-3.3666763499999998E-5,1.5758188369999999E-2,23.37884141,null,-7.50847E-7,3.0730200000000001E-3,1.6631300000000002E-2,null,-9.8919999999999999E-7,2.9291147999999999E-3,0,null,null,-6.5181000000000003E-6,-1.0794369999999999E-3,1.0281727780000001,null,null,-1.0999999999999999E-2,26.774999999999999]
["Vero 10","40A","B",1001,"BXRC",{"$f":"MasterTable[[#This Row],[Product Family]]&\"-\"&MasterTable[[#This Row],[CCT/CRI]]&MasterTable[[#This Row],[Arrangement]]","v":"Vero 10-40AB"},{"$f":"MasterTable[[#This Row],[Generation]]&\"-\"&MasterTable[[#This Row],[CCT/CRI]]&IF(MasterTable[[#This Row],[Lumen Family]]<999,\"0\"&MasterTable[[#This Row],[Lumen Family]],MasterTable[[#This Row],[Lumen Family]])&\"-\"&MasterTable[[#This Row],[Arrangement]]&\"-2x\"","v":"BXRC-40A1001-B-2x"},970,0.47,26.5,350,{"$f":"INDEX(FF_stats31333[],MATCH(A173,FF_stats31333[Form Factor],0),2)","v":700},12,-2.96E-11,5.4100000000000001E-8,-3.7200000000000003E-5,1.8700000000000001E-2,22.6,null,-9.4669999999999997E-7,3.1961206E-3,0,null,-9.6720000000000003E-7,2.8497370999999998E-3,0,null,null,-3.6754E-6,-1.4946821E-3,1.0385171968,null,null,-1.4E-2,26.85]
["Vero 10","40E","B",1000,"BXRC",{"$f":"MasterTable[[#This Row],[Product Family]]&\"-\"&MasterTable[[#This Row],[CCT/CRI]]&MasterTable[[#This Row],[Arrangement]]","v":"Vero 10-40EB"},{"$f":"MasterTable[[#This Row],[Generation]]&\"-\"&MasterTable[[#This Row],[CCT/CRI]]&IF(MasterTable[[#This Row],[Lumen Family]]<999,\"0\"&MasterTable[[#This Row],[Lumen Family]],MasterTable[[#This Row],[Lumen Family]])&\"-\"&MasterTable[[#This Row],[Arrangement]]&\"-2x\"","v":"BXRC-40E1000-B-2x"},1274,0.47,26.5,350,700,12,-3.2099999999999998E-11,5.4800000000000001E-8,-3.5200000000000002E-5,1.78E-2,22.7,null,-9.0240000000000003E-7,3.1841790000000001E-3,0,null,-9.8919999999999999E-7,2.9291147999999999E-3,0,null,null,-6.2593999999999997E-6,-1.184453E-3,1.0315523711000001,null,null,-1.4E-2,26.85]
["Vero 10","40G","B",1000,"BXRC",{"$f":"MasterTable[[#This Row],[Product Family]]&\"-\"&MasterTable[[#This Row],[CCT/CRI]]&MasterTable[[#This Row],[Arrangement]]","v":"Vero 10-40GB"},{"$f":"MasterTable[[#This Row],[Generation]]&\"-\"&MasterTable[[#This Row],[CCT/CRI]]&IF(MasterTable[[#This Row],[Lumen Family]]<999,\"0\"&MasterTable[[#This Row],[Lumen Family]],MasterTable[[#This Row],[Lumen Family]])&\"-\"&MasterTable[[#This Row],[Arrangement]]&\"-2x\"","v":"BXRC-40G1000-B-2x"},1076,0.47,26.5,350,700,12,-3.2099999999999998E-11,5.4800000000000001E-8,-3.5200000000000002E-5,1.78E-2,22.7,null,-9.0240000000000003E-7,3.1841790000000001E-3,0,null,-9.8919999999999999E-7,2.9291147999999999E-3,0,null,null,-6.2593999999999997E-6,-1.184453E-3,1.0315523711000001,null,null,-1.4E-2,26.85]
["Vero 10","50C","B",1000,"BXRC",{"$f":"MasterTable[[#This Row],[Product Family]]&\"-\"&MasterTable[[#This Row],[CCT/CRI]]&MasterTable[[#This Row],[Arrangement]]","v":"Vero 10-50CB"},{"$f":"MasterTable[[#This Row],[Generation]]&\"-\"&MasterTable[[#This Row],[CCT/CRI]]&IF(MasterTable[[#This Row],[Lumen Family]]<999,\"0\"&MasterTable[[#This Row],[Lumen Family]],MasterTable[[#This Row],[Lumen Family]])&\"-\"&MasterTable[[#This Row],[Arrangement]]&\"-2x\"","v":"BXRC-50C1000-B-2x"},1330,0.47,26.5,350,{"$f":"INDEX(FF_stats31333[],MATCH(A176,FF_stats31333[Form Factor],0),2)","v":700},12,-3.2099999999999998E-11,5.4800000000000001E-8,-3.5200000000000002E-5,1.78E-2,22.7,null,-9.0240000000000003E-7,3.1841790000000001E-3,0,null,-9.8919999999999999E-7,2.9291147999999999E-3,0,null,null,-3.4916000000000002E-6,-1.6345621E-3,1.0433497882,null,null,-1.4E-2,26.85]
["Vero 10","50E","B",1000,"BXRC",{"$f":"MasterTable[[#This Row],[Product Family]]&\"-\"&MasterTable[[#This Row],[CCT/CRI]]&MasterTable[[#This Row],[Arrangement]]","v":"Vero 10-50EB"},{"$f":"MasterTable[[#This Row],[Generation]]&\"-\"&MasterTable[[#This Row],[CCT/CRI]]&IF(MasterTable[[#This Row],[Lumen Family]]<999,\"0\"&MasterTable[[#This Row],[Lumen Family]],MasterTable[[#This Row],[Lumen Family]])&\"-\"&MasterTable[[#This Row],[Arrangement]]&\"-2x\"","v":"BXRC-50E1000-B-2x"},1274,0.47,26.5,350,{"$f":"INDEX(FF_stats31333[],MATCH(A177,FF_stats31333[Form Factor],0),2)","v":700},12,-3.2099999999999998E-11,5.4800000000000001E-8,-3.5200000000000002E-5,1.78E-2,22.7,null,-9.0240000000000003E-7,3.1841790000000001E-3,0,null,-9.8919999999999999E-7,2.9291147999999999E-3,0,null,null,-3.4916000000000002E-6,-1.6345621E-3,1.0433497882,null,null,-1.4E-2,26.85]
["Vero 10","50G","B",1000,"BXRC",{"$f":"MasterTable[[#This Row],[Product Family]]&\"-\"&MasterTable[[#This Row],[CCT/CRI]]&MasterTable[[#This Row],[Arrangement]]","v":"Vero 10-50GB"},{"$f":"MasterTable[[#This Row],[Generation]]&\"-\"&MasterTable[[#This Row],[CCT/CRI]]&IF(MasterTable[[#This Row],[Lumen Family]]<999,\"0\"&MasterTable[[#This Row],[Lumen Family]],MasterTable[[#This Row],[Lumen Family]])&\"-\"&MasterTable[[#This Row],[Arrangement]]&\"-2x\"","v":"BXRC-50G1000-B-2x"},1106,0.47,26.5,350,{"$f":"INDEX(FF_stats31333[],MATCH(A178,FF_stats31333[Form Factor],0),2)","v":700},12,-3.2099999999999998E-11,5.4800000000000001E-8,-3.5200000000000002E-5,1.78E-2,22.7,null,-9.0240000000000003E-7,3.1841790000000001E-3,0,null,-9.8919999999999999E-7,2.9291147999999999E-3,0,null,null,-3.4916000000000002E-6,-1.6345621E-3,1.0433497882,null,null,-1.4E-2,26.85]
["Vero 13","27E","C",2000,"BXRC",{"$f":"MasterTable[[#This Row],[Product Family]]&\"-\"&MasterTable[[#This Row],[CCT/CRI]]&MasterTable[[#This Row],[Arrangement]]","v":"Vero 13-27EC"},{"$f":"MasterTable[[#This Row],[Generation]]&\"-\"&MasterTable[[#This Row],[CCT/CRI]]&IF(MasterTable[[#This Row],[Lumen Family]]<999,\"0\"&MasterTable[[#This Row],[Lumen Family]],MasterTable[[#This Row],[Lumen Family]])&\"-\"&MasterTable[[#This Row],[Arrangement]]&\"-2x\"","v":"BXRC-27E2000-C-2x"},2019,0.22,32.299999999999997,500,1050,33,-9.5076604018999997E-12,2.4428286607E-8,-2.3169246580000001E-5,1.4970494217E-2,28.116669275,null,-5.2056577008E-7,2.2529763468E-3,4.8311928226E-3,null,-4.9200361948999999E-7,2.2350279158000002E-3,6.8891795015E-3,-3.29E-9,5.2499999999999995E-7,-2.5199999999999999E-5,-1.24E-3,1.04,null,null,-1.7000000000000001E-2,32.725000000000001]
["Vero 13","27G","C",2000,"BXRC",{"$f":"MasterTable[[#This Row],[Product Family]]&\"-\"&MasterTable[[#This Row],[CCT/CRI]]&MasterTable[[#This Row],[Arrangement]]","v":"Vero 13-27GC"},{"$f":"MasterTable[[#This Row],[Generation]]&\"-\"&MasterTable[[#This Row],[CCT/CRI]]&IF(MasterTable[[#This Row],[Lumen Family]]<999,\"0\"&MasterTable[[#This Row],[Lumen Family]],MasterTable[[#This Row],[Lumen Family]])&\"-\"&MasterTable[[#This Row],[Arrangement]]&\"-2x\"","v":"BXRC-27G2000-C-2x"},1680,0.22,32.299999999999997,500,1050,33,-9.5076604018999997E-12,2.4428286607E-8,-2.3169246580000001E-5,1.4970494217E-2,28.116669275,null,-5.2056577008E-7,2.2529763468E-3,4.8311928226E-3,null,-4.9200361948999999E-7,2.2350279158000002E-3,6.8891795015E-3,-3.29E-9,5.2499999999999995E-7,-2.5199999999999999E-5,-1.24E-3,1.04,null,null,-1.7000000000000001E-2,32.725000000000001]
["Vero 13","27H","C",2000,"BXRC",{"$f":"MasterTable[[#This Row],[Product Family]]&\"-\"&MasterTable[[#This Row],[CCT/CRI]]&MasterTable[[#This Row],[Arrangement]]","v":"Vero 13-27HC"},{"$f":"MasterTable[[#This Row],[Generation]]&\"-\"&MasterTable[[#This Row],[CCT/CRI]]&IF(MasterTable[[#This Row],[Lumen Family]]<999,\"0\"&MasterTable[[#This Row],[Lumen Family]],MasterTable[[#This Row],[Lumen Family]])&\"-\"&MasterTable[[#This Row],[Arrangement]]&\"-xx\"","v":"BXRC-27H2000-C-xx"},1331,0.22,32.299999999999997,500,1050,33,-9.5076604018999997E-12,2.4428286607E-8,-2.3169246580000001E-5,1.4970494217E-2,28.116669275,null,-4.2319999999999998E-7,2.2028993E-3,5.1414701999999996E-3,null,-4.9200361948999999E-7,2.2350279158000002E-3,6.8891795015E-3,null,null,-8.2609999999999993E-6,-1.5923074E-3,1.0253797471999999,null,null,-1.7000000000000001E-2,32.725000000000001]
["Vero 13","30A","C",2001,"BXRC",{"$f":"MasterTable[[#This Row],[Product Family]]&\"-\"&MasterTable[[#This Row],[CCT/CRI]]&MasterTable[[#This Row],[Arrangement]]","v":"Vero 13-30AC"},{"$f":"MasterTable[[#This Row],[Generation]]&\"-\"&MasterTable[[#This Row],[CCT/CRI]]&IF(MasterTable[[#This Row],[Lumen Family]]<999,\"0\"&MasterTable[[#This Row],[Lumen Family]],MasterTable[[#This Row],[Lumen Family]])&\"-\"&MasterTable[[#This Row],[Arrangement]]&\"-23\"","v":"BXRC-30A2001-C-23"},1500,0.22,32.299999999999997,500,{"$f":"INDEX(FF_stats31333[],MATCH(A182,FF_stats31333[Form Factor],0),2)","v":1050},33,-9.8199999999999998E-12,2.5399999999999999E-8,-2.4600000000000002E-5,1.5299999999999999E-2,28.2,null,-5.2770000000000005E-7,2.2695978000000002E-3,0,null,-4.4140000000000002E-7,2.0207807E-3,0,null,null,-3.3726999999999999E-6,-1.4857080000000001E-3,1.0387775519,null,null,-1.7000000000000001E-2,32.725000000000001]
["Vero 13","30E","C",2000,"BXRC",{"$f":"MasterTable[[#This Row],[Product Family]]&\"-\"&MasterTable[[#This Row],[CCT/CRI]]&MasterTable[[#This Row],[Arrangement]]","v":"Vero 13-30EC"},{"$f":"MasterTable[[#This Row],[Generation]]&\"-\"&MasterTable[[#This Row],[CCT/CRI]]&IF(MasterTable[[#This Row],[Lumen Family]]<999,\"0\"&MasterTable[[#This Row],[Lumen Family]],MasterTable[[#This Row],[Lumen Family]])&\"-\"&MasterTable[[#This Row],[Arrangement]]&\"-2x\"","v":"BXRC-30E2000-C-2x"},2120,0.22,32.299999999999997,500,1050,33,-9.5076604018999997E-12,2.4428286607E-8,-2.3169246580000001E-5,1.4970494217E-2,28.116669275,null,-5.2056577008E-7,2.2529763468E-3,4.8311928226E-3,null,-4.9200361948999999E-7,2.2350279158000002E-3,6.8891795015E-3,-3.29E-9,5.2499999999999995E-7,-2.5199999999999999E-5,-1.24E-3,1.04,null,null,-1.7000000000000001E-2,32.725000000000001]
["Vero 13","30G","C",2000,"BXRC",{"$f":"MasterTable[[#This Row],[Product Family]]&\"-\"&MasterTable[[#This Row],[CCT/CRI]]&MasterTable[[#This Row],[Arrangement]]","v":"Vero 13-30GC"},{"$f":"MasterTable[[#This Row],[Generation]]&\"-\"&MasterTable[[#This Row],[CCT/CRI]]&IF(MasterTable[[#This Row],[Lumen Family]]<999,\"0\"&MasterTable[[#This Row],[Lumen Family]],MasterTable[[#This Row],[Lumen Family]])&\"-\"&MasterTable[[#This Row],[Arrangement]]&\"-2x\"","v":"BXRC-30G2000-C-2x"},1760,0.22,32.299999999999997,500,1050,33,-9.5076604018999997E-12,2.4428286607E-8,-2.3169246580000001E-5,1.4970494217E-2,28.116669275,null,-5.2056577008E-7,2.2529763468E-3,4.8311928226E-3,null,-4.9200361948999999E-7,2.2350279158000002E-3,6.8891795015E-3,-3.29E-9,5.2499999999999995E-7,-2.5199999999999999E-5,-1.24E-3,1.04,null,null,-1.7000000000000001E-2,32.725000000000001]
["Vero 13","30H","C",2000,"BXRC",{"$f":"MasterTable[[#This Row],[Product Family]]&\"-\"&MasterTable[[#This Row],[CCT/CRI]]&MasterTable[[#This Row],[Arrangement]]","v":"Vero 13-30HC"},{"$f":"MasterTable[[#This Row],[Generation]]&\"-\"&MasterTable[[#This Row],[CCT/CRI]]&IF(MasterTable[[#This Row],[Lumen Family]]<999,\"0\"&MasterTable[[#This Row],[Lumen Family]],MasterTable[[#This Row],[Lumen Family]])&\"-\"&MasterTable[[#This Row],[Arrangement]]&\"-xx\"","v":"BXRC-30H2000-C-xx"},1435,0.22,32.299999999999997,500,1050,33,-9.5076604018999997E-12,2.4428286607E-8,-2.3169246580000001E-5,1.4970494217E-2,28.116669275,null,-4.2319999999999998E-7,2.2028993E-3,5.1414701999999996E-3,null,-4.9200361948999999E-7,2.2350279158000002E-3,6.8891795015E-3,null,null,-7.0491E-6,-1.7714645000000001E-3,1.0300704907,null,null,-1.7000000000000001E-2,32.725000000000001]
["Vero 13","35A","C",2001,"BXRC",{"$f":"MasterTable[[#This Row],[Product Family]]&\"-\"&MasterTable[[#This Row],[CCT/CRI]]&MasterTable[[#This Row],[Arrangement]]","v":"Vero 13-35AC"},{"$f":"MasterTable[[#This Row],[Generation]]&\"-\"&MasterTable[[#This Row],[CCT/CRI]]&IF(MasterTable[[#This Row],[Lumen Family]]<999,\"0\"&MasterTable[[#This Row],[Lumen Family]],MasterTable[[#This Row],[Lumen Family]])&\"-\"&MasterTable[[#This Row],[Arrangement]]&\"-23\"","v":"BXRC-35A2001-C-23"},1628,0.22,32.299999999999997,500,{"$f":"INDEX(FF_stats31333[],MATCH(A186,FF_stats31333[Form Factor],0),2)","v":1050},33,-9.8199999999999998E-12,2.5399999999999999E-8,-2.4600000000000002E-5,1.5299999999999999E-2,28.2,null,-5.2770000000000005E-7,2.2695978000000002E-3,0,null,-4.4140000000000002E-7,2.0207807E-3,0,null,null,-3.3726999999999999E-6,-1.4857080000000001E-3,1.0387775519,null,null,-1.7000000000000001E-2,32.725000000000001]
["Vero 13","35E","C",2000,"BXRC",{"$f":"MasterTable[[#This Row],[Product Family]]&\"-\"&MasterTable[[#This Row],[CCT/CRI]]&MasterTable[[#This Row],[Arrangement]]","v":"Vero 13-35EC"},{"$f":"MasterTable[[#This Row],[Generation]]&\"-\"&MasterTable[[#This Row],[CCT/CRI]]&IF(MasterTable[[#This Row],[Lumen Family]]<999,\"0\"&MasterTable[[#This Row],[Lumen Family]],MasterTable[[#This Row],[Lumen Family]])&\"-\"&MasterTable[[#This Row],[Arrangement]]&\"-2x\"","v":"BXRC-35E2000-C-2x"},2150,0.22,32.299999999999997,500,1050,33,-9.5076604018999997E-12,2.4428286607E-8,-2.3169246580000001E-5,1.4970494217E-2,28.116669275,null,-5.2056577008E-7,2.2529763468E-3,4.8311928226E-3,null,-4.9200361948999999E-7,2.2350279158000002E-3,6.8891795015E-3,-3.29E-9,5.2499999999999995E-7,-2.5199999999999999E-5,-1.24E-3,1.04,null,null,-1.7000000000000001E-2,32.725000000000001]
["Vero 13","35G","C",2000,"BXRC",{"$f":"MasterTable[[#This Row],[Product Family]]&\"-\"&MasterTable[[#This Row],[CCT/CRI]]&MasterTable[[#This Row],[Arrangement]]","v":"Vero 13-35GC"},{"$f":"MasterTable[[#This Row],[Generation]]&\"-\"&MasterTable[[#This Row],[CCT/CRI]]&IF(MasterTable[[#This Row],[Lumen Family]]<999,\"0\"&MasterTable[[#This Row],[Lumen Family]],MasterTable[[#This Row],[Lumen Family]])&\"-\"&MasterTable[[#This Row],[Arrangement]]&\"-2x\"","v":"BXRC-35G2000-C-2x"},1841,0.22,32.299999999999997,500,1050,33,-9.5076604018999997E-12,2.4428286607E-8,-2.3169246580000001E-5,1.4970494217E-2,28.116669275,null,-5.2056577008E-7,2.2529763468E-3,4.8311928226E-3,null,-4.9200361948999999E-7,2.2350279158000002E-3,6.8891795015E-3,-3.29E-9,5.2499999999999995E-7,-2.5199999999999999E-5,-1.24E-3,1.04,null,null,-1.7000000000000001E-2,32.725000000000001]
["Vero 13","40A","C",2001,"BXRC",{"$f":"MasterTable[[#This Row],[Product Family]]&\"-\"&MasterTable[[#This Row],[CCT/CRI]]&MasterTable[[#This Row],[Arrangement]]","v":"Vero 13-40AC"},{"$f":"MasterTable[[#This Row],[Generation]]&\"-\"&MasterTable[[#This Row],[CCT/CRI]]&IF(MasterTable[[#This Row],[Lumen Family]]<999,\"0\"&MasterTable[[#This Row],[Lumen Family]],MasterTable[[#This Row],[Lumen Family]])&\"-\"&MasterTable[[#This Row],[Arrangement]]&\"-23\"","v":"BXRC-40A2001-C-23"},1740,0.22,32.299999999999997,500,{"$f":"INDEX(FF_stats31333[],MATCH(A189,FF_stats31333[Form Factor],0),2)","v":1050},33,-9.8199999999999998E-12,2.5399999999999999E-8,-2.4600000000000002E-5,1.5299999999999999E-2,28.2,null,-5.2770000000000005E-7,2.2695978000000002E-3,0,null,-4.4140000000000002E-7,2.0207807E-3,0,null,null,-3.0180000000000002E-6,-1.518859E-3,1.0387785069,null,null,-1.7000000000000001E-2,32.725000000000001]
["Vero 13","40E","C",2000,"BXRC",{"$f":"MasterTable[[#This Row],[Product Family]]&\"-\"&MasterTable[[#This Row],[CCT/CRI]]&MasterTable[[#This Row],[Arrangement]]","v":"Vero 13-40EC"},{"$f":"MasterTable[[#This Row],[Generation]]&\"-\"&MasterTable[[#This Row],[CCT/CRI]]&IF(MasterTable[[#This Row],[Lumen Family]]<999,\"0\"&MasterTable[[#This Row],[Lumen Family]],MasterTable[[#This Row],[Lumen Family]])&\"-\"&MasterTable[[#This Row],[Arrangement]]&\"-2x\"","v":"BXRC-40E2000-C-2x"},2213,0.22,32.299999999999997,500,1050,33,-9.5076604018999997E-12,2.4428286607E-8,-2.3169246580000001E-5,1.4970494217E-2,28.116669275,null,-5.2056577008E-7,2.2529763468E-3,4.8311928226E-3,null,-4.9200361948999999E-7,2.2350279158000002E-3,6.8891795015E-3,null,-1.02E-7,1.27E-5,-2.0200000000000001E-3,1.04,null,null,-1.7000000000000001E-2,32.725000000000001]
["Vero 13","40G","C",2000,"BXRC",{"$f":"MasterTable[[#This Row],[Product Family]]&\"-\"&MasterTable[[#This Row],[CCT/CRI]]&MasterTable[[#This Row],[Arrangement]]","v":"Vero 13-40GC"},{"$f":"MasterTable[[#This Row],[Generation]]&\"-\"&MasterTable[[#This Row],[CCT/CRI]]&IF(MasterTable[[#This Row],[Lumen Family]]<999,\"0\"&MasterTable[[#This Row],[Lumen Family]],MasterTable[[#This Row],[Lumen Family]])&\"-\"&MasterTable[[#This Row],[Arrangement]]&\"-2x\"","v":"BXRC-40G2000-C-2x"},1900,0.22,32.299999999999997,500,1050,33,-9.5076604018999997E-12,2.4428286607E-8,-2.3169246580000001E-5,1.4970494217E-2,28.116669275,null,-5.2056577008E-7,2.2529763468E-3,4.8311928226E-3,null,-4.9200361948999999E-7,2.2350279158000002E-3,6.8891795015E-3,null,-1.02E-7,1.27E-5,-2.0200000000000001E-3,1.04,null,null,-1.7000000000000001E-2,32.725000000000001]
["Vero 13","50C","C",2000,"BXRC",{"$f":"MasterTable[[#This Row],[Product Family]]&\"-\"&MasterTable[[#This Row],[CCT/CRI]]&MasterTable[[#This Row],[Arrangement]]","v":"Vero 13-50CC"},{"$f":"MasterTable[[#This Row],[Generation]]&\"-\"&MasterTable[[#This Row],[CCT/CRI]]&IF(MasterTable[[#This Row],[Lumen Family]]<999,\"0\"&MasterTable[[#This Row],[Lumen Family]],MasterTable[[#This Row],[Lumen Family]])&\"-\"&MasterTable[[#This Row],[Arrangement]]&\"-2x\"","v":"BXRC-50C2000-C-2x"},2342,0.22,32.299999999999997,500,1050,33,-9.5076604018999997E-12,2.4428286607E-8,-2.3169246580000001E-5,1.4970494217E-2,28.116669275,null,-5.2056577008E-7,2.2529763468E-3,4.8311928226E-3,null,-4.9200361948999999E-7,2.2350279158000002E-3,6.8891795015E-3,null,null,-3.9999999999999998E-6,-1.6000000000000001E-3,1.0421,null,null,-1.7000000000000001E-2,32.725000000000001]
["Vero 13","50E","C",2000,"BXRC",{"$f":"MasterTable[[#This Row],[Product Family]]&\"-\"&MasterTable[[#This Row],[CCT/CRI]]&MasterTable[[#This Row],[Arrangement]]","v":"Vero 13-50EC"},{"$f":"MasterTable[[#This Row],[Generation]]&\"-\"&MasterTable[[#This Row],[CCT/CRI]]&IF(MasterTable[[#This Row],[Lumen Family]]<999,\"0\"&MasterTable[[#This Row],[Lumen Family]],MasterTable[[#This Row],[Lumen Family]])&\"-\"&MasterTable[[#This Row],[Arrangement]]&\"-2x\"","v":"BXRC-50E2000-C-2x"},2245,0.22,32.299999999999997,500,1050,33,-9.5076604018999997E-12,2.4428286607E-8,-2.3169246580000001E-5,1.4970494217E-2,28.116669275,null,-5.2056577008E-7,2.2529763468E-3,4.8311928226E-3,null,-4.9200361948999999E-7,2.2350279158000002E-3,6.8891795015E-3,null,null,-3.9999999999999998E-6,-1.6000000000000001E-3,1.0421,null,null,-1.7000000000000001E-2,32.725000000000001]
["Vero 13","50G","C",2000,"BXRC",{"$f":"MasterTable[[#This Row],[Product Family]]&\"-\"&MasterTable[[#This Row],[CCT/CRI]]&MasterTable[[#This Row],[Arrangement]]","v":"Vero 13-50GC"},{"$f":"MasterTable[[#This Row],[Generation]]&\"-\"&MasterTable[[#This Row],[CCT/CRI]]&IF(MasterTable[[#This Row],[Lumen Family]]<999,\"0\"&MasterTable[[#This Row],[Lumen Family]],MasterTable[[#This Row],[Lumen Family]])&\"-\"&MasterTable[[#This Row],[Arrangement]]&\"-2x\"","v":"BXRC-50G2000-C-2x"},2015,0.22,32.299999999999997,500,1050,33,-9.5076604018999997E-12,2.4428286607E-8,-2.3169246580000001E-5,1.4970494217E-2,28.116669275,null,-5.2056577008E-7,2.2529763468E-3,4.8311928226E-3,null,-4.9200361948999999E-7,2.2350279158000002E-3,6.8891795015E-3,null,null,-3.9999999999999998E-6,-1.6000000000000001E-3,1.0421,null,null,-1.7000000000000001E-2,32.725000000000001]
["Vero 18","17E","F",4000,"BXRC",{"$f":"MasterTable[[#This Row],[Product Family]]&\"-\"&MasterTable[[#This Row],[CCT/CRI]]&MasterTable[[#This Row],[Arrangement]]","v":"Vero 18-17EF"},{"$f":"MasterTable[[#This Row],[Generation]]&\"-\"&MasterTable[[#This Row],[CCT/CRI]]&IF(MasterTable[[#This Row],[Lumen Family]]<999,\"0\"&MasterTable[[#This Row],[Lumen Family]],MasterTable[[#This Row],[Lumen Family]])&\"-\"&MasterTable[[#This Row],[Arrangement]]&\"-xx\"","v":"BXRC-17E4000-F-xx"},2254,0.13,29.5,1050,{"$f":"INDEX(FF_stats31333[],MATCH(A195,FF_stats31333[Form Factor],0),2)","v":2100},60,-4.3296141676000001E-13,2.4210131023999999E-9,-5.0293161703999997E-6,6.8884526139999999E-3,25.523184017999998,null,-9.7300000000000004E-8,1.0486146E-3,6.6521280999999998E-3,null,-1.211637044E-7,1.0744689300000001E-3,6.8809729823E-3,null,null,-7.1756999999999998E-6,-9.3057809999999997E-4,1.0198635790999999,null,null,-1.4999999999999999E-2,29.875]
["Vero 18","25E","F",4000,"BXRC",{"$f":"MasterTable[[#This Row],[Product Family]]&\"-\"&MasterTable[[#This Row],[CCT/CRI]]&MasterTable[[#This Row],[Arrangement]]","v":"Vero 18-25EF"},{"$f":"MasterTable[[#This Row],[Generation]]&\"-\"&MasterTable[[#This Row],[CCT/CRI]]&IF(MasterTable[[#This Row],[Lumen Family]]<999,\"0\"&MasterTable[[#This Row],[Lumen Family]],MasterTable[[#This Row],[Lumen Family]])&\"-\"&MasterTable[[#This Row],[Arrangement]]&\"-xx\"","v":"BXRC-25E4000-F-xx"},3651,0.13,29.5,1050,{"$f":"INDEX(FF_stats31333[],MATCH(A196,FF_stats31333[Form Factor],0),2)","v":2100},60,-4.3296141676000001E-13,2.4210131023999999E-9,-5.0293161703999997E-6,6.8884526139999999E-3,25.523184017999998,null,-9.7300000000000004E-8,1.0486146E-3,6.6521280999999998E-3,null,-1.211637044E-7,1.0744689300000001E-3,6.8809729823E-3,null,null,-6.472E-6,-1.0156563999999999E-3,1.0211416334000001,null,null,-1.4999999999999999E-2,29.875]
["Vero 18","27E","F",4000,"BXRC",{"$f":"MasterTable[[#This Row],[Product Family]]&\"-\"&MasterTable[[#This Row],[CCT/CRI]]&MasterTable[[#This Row],[Arrangement]]","v":"Vero 18-27EF"},{"$f":"MasterTable[[#This Row],[Generation]]&\"-\"&MasterTable[[#This Row],[CCT/CRI]]&IF(MasterTable[[#This Row],[Lumen Family]]<999,\"0\"&MasterTable[[#This Row],[Lumen Family]],MasterTable[[#This Row],[Lumen Family]])&\"-\"&MasterTable[[#This Row],[Arrangement]]&\"-2x\"","v":"BXRC-27E4000-F-2x"},3872,0.13,29.5,1050,2100,60,-4.3296141676000001E-13,2.4210131023999999E-9,-5.0293161703999997E-6,6.8884526139999999E-3,25.523184017999998,null,-1.3106025059999999E-7,1.0878699984E-3,4.2883455537999996E-3,null,-1.211637044E-7,1.0744689300000001E-3,6.8809729823E-3,6.6426899999999999E-9,-1.4332000000000001E-6,1.01154E-4,-4.1218399999999999E-3,1.0607,null,null,-1.4999999999999999E-2,29.875]
["Vero 18","27G","F",4000,"BXRC",{"$f":"MasterTable[[#This Row],[Product Family]]&\"-\"&MasterTable[[#This Row],[CCT/CRI]]&MasterTable[[#This Row],[Arrangement]]","v":"Vero 18-27GF"},{"$f":"MasterTable[[#This Row],[Generation]]&\"-\"&MasterTable[[#This Row],[CCT/CRI]]&IF(MasterTable[[#This Row],[Lumen Family]]<999,\"0\"&MasterTable[[#This Row],[Lumen Family]],MasterTable[[#This Row],[Lumen Family]])&\"-\"&MasterTable[[#This Row],[Arrangement]]&\"-2x\"","v":"BXRC-27G4000-F-2x"},3221,0.13,29.5,1050,2100,60,-4.3296141676000001E-13,2.4210131023999999E-9,-5.0293161703999997E-6,6.8884526139999999E-3,25.523184017999998,null,-1.3106025059999999E-7,1.0878699984E-3,4.2883455537999996E-3,null,-1.211637044E-7,1.0744689300000001E-3,6.8809729823E-3,6.6426899999999999E-9,-1.4332000000000001E-6,1.01154E-4,-4.1218399999999999E-3,1.0607,null,null,-1.4999999999999999E-2,29.875]
["Vero 18","27H","F",4000,"BXRC",{"$f":"MasterTable[[#This Row],[Product Family]]&\"-\"&MasterTable[[#This Row],[CCT/CRI]]&MasterTable[[#This Row],[Arrangement]]","v":"Vero 18-27HF"},{"$f":"MasterTable[[#This Row],[Generation]]&\"-\"&MasterTable[[#This Row],[CCT/CRI]]&IF(MasterTable[[#This Row],[Lumen Family]]<999,\"0\"&MasterTable[[#This Row],[Lumen Family]],MasterTable[[#This Row],[Lumen Family]])&\"-\"&MasterTable[[#This Row],[Arrangement]]&\"-xx\"","v":"BXRC-27H4000-F-xx"},2534,0.13,29.5,1050,2100,60,-4.3296141676000001E-13,2.4210131023999999E-9,-5.0293161703999997E-6,6.8884526139999999E-3,25.523184017999998,null,-9.7300000000000004E-8,1.0486146E-3,6.6521280999999998E-3,null,-1.211637044E-7,1.0744689300000001E-3,6.8809729823E-3,null,null,-6.7352000000000003E-6,-1.9298129E-3,1.0385837507,null,null,-1.4999999999999999E-2,29.875]
["Vero 18","30A","F",4001,"BXRC",{"$f":"MasterTable[[#This Row],[Product Family]]&\"-\"&MasterTable[[#This Row],[CCT/CRI]]&MasterTable[[#This Row],[Arrangement]]","v":"Vero 18-30AF"},{"$f":"MasterTable[[#This Row],[Generation]]&\"-\"&MasterTable[[#This Row],[CCT/CRI]]&IF(MasterTable[[#This Row],[Lumen Family]]<999,\"0\"&MasterTable[[#This Row],[Lumen Family]],MasterTable[[#This Row],[Lumen Family]])&\"-\"&MasterTable[[#This Row],[Arrangement]]&\"-23\"","v":"BXRC-30A4001-F-23"},2897,0.13,29.5,1050,{"$f":"INDEX(FF_stats31333[],MATCH(A200,FF_stats31333[Form Factor],0),2)","v":2100},60,-6.0700000000000004E-13,3.12E-9,-5.8599999999999998E-6,6.8300000000000001E-3,25.9,null,-1.2569999999999999E-7,1.0863931E-3,0,null,-1.036E-7,9.6983370000000005E-4,0,null,null,-4.2018000000000002E-6,-1.3241850000000001E-3,1.0346625890000001,null,null,-1.4999999999999999E-2,29.875]
["Vero 18","30E","F",4000,"BXRC",{"$f":"MasterTable[[#This Row],[Product Family]]&\"-\"&MasterTable[[#This Row],[CCT/CRI]]&MasterTable[[#This Row],[Arrangement]]","v":"Vero 18-30EF"},{"$f":"MasterTable[[#This Row],[Generation]]&\"-\"&MasterTable[[#This Row],[CCT/CRI]]&IF(MasterTable[[#This Row],[Lumen Family]]<999,\"0\"&MasterTable[[#This Row],[Lumen Family]],MasterTable[[#This Row],[Lumen Family]])&\"-\"&MasterTable[[#This Row],[Arrangement]]&\"-2x\"","v":"BXRC-30E4000-F-2x"},4050,0.13,29.5,1050,2100,60,-4.3296141676000001E-13,2.4210131023999999E-9,-5.0293161703999997E-6,6.8884526139999999E-3,25.523184017999998,null,-1.3106025059999999E-7,1.0878699984E-3,4.2883455537999996E-3,null,-1.211637044E-7,1.0744689300000001E-3,6.8809729823E-3,6.6426899999999999E-9,-1.4332000000000001E-6,1.01154E-4,-4.1218399999999999E-3,1.0607,null,null,-1.4999999999999999E-2,29.875]
["Vero 18","30G","F",4000,"BXRC",{"$f":"MasterTable[[#This Row],[Product Family]]&\"-\"&MasterTable[[#This Row],[CCT/CRI]]&MasterTable[[#This Row],[Arrangement]]","v":"Vero 18-30GF"},{"$f":"MasterTable[[#This Row],[Generation]]&\"-\"&MasterTable[[#This Row],[CCT/CRI]]&IF(MasterTable[[#This Row],[Lumen Family]]<999,\"0\"&MasterTable[[#This Row],[Lumen Family]],MasterTable[[#This Row],[Lumen Family]])&\"-\"&MasterTable[[#This Row],[Arrangement]]&\"-2x\"","v":"BXRC-30G4000-F-2x"},3376,0.13,29.5,1050,2100,60,-4.3296141676000001E-13,2.4210131023999999E-9,-5.0293161703999997E-6,6.8884526139999999E-3,25.523184017999998,null,-1.3106025059999999E-7,1.0878699984E-3,4.2883455537999996E-3,null,-1.211637044E-7,1.0744689300000001E-3,6.8809729823E-3,6.6426899999999999E-9,-1.4332000000000001E-6,1.01154E-4,-4.1218399999999999E-3,1.0607,null,null,-1.4999999999999999E-2,29.875]
["Vero 18","30H","F",4000,"BXRC",{"$f":"MasterTable[[#This Row],[Product Family]]&\"-\"&MasterTable[[#This Row],[CCT/CRI]]&MasterTable[[#This Row],[Arrangement]]","v":"Vero 18-30HF"},{"$f":"MasterTable[[#This Row],[Generation]]&\"-\"&MasterTable[[#This Row],[CCT/CRI]]&IF(MasterTable[[#This Row],[Lumen Family]]<999,\"0\"&MasterTable[[#This Row],[Lumen Family]],MasterTable[[#This Row],[Lumen Family]])&\"-\"&MasterTable[[#This Row],[Arrangement]]&\"-xx\"","v":"BXRC-30H4000-F-xx"},2724,0.13,29.5,1050,2100,60,-4.3296141676000001E-13,2.4210131023999999E-9,-5.0293161703999997E-6,6.8884526139999999E-3,25.523184017999998,null,-9.7300000000000004E-8,1.0486146E-3,6.6521280999999998E-3,null,-1.211637044E-7,1.0744689300000001E-3,6.8809729823E-3,null,null,-7.3562E-6,-1.5915528E-3,1.0282825551000001,null,null,-1.4999999999999999E-2,29.875]
["Vero 18","35A","F",4001,"BXRC",{"$f":"MasterTable[[#This Row],[Product Family]]&\"-\"&MasterTable[[#This Row],[CCT/CRI]]&MasterTable[[#This Row],[Arrangement]]","v":"Vero 18-35AF"},{"$f":"MasterTable[[#This Row],[Generation]]&\"-\"&MasterTable[[#This Row],[CCT/CRI]]&IF(MasterTable[[#This Row],[Lumen Family]]<999,\"0\"&MasterTable[[#This Row],[Lumen Family]],MasterTable[[#This Row],[Lumen Family]])&\"-\"&MasterTable[[#This Row],[Arrangement]]&\"-23\"","v":"BXRC-35A4001-F-23"},3096,0.13,29.5,1050,{"$f":"INDEX(FF_stats31333[],MATCH(A204,FF_stats31333[Form Factor],0),2)","v":2100},60,-6.0700000000000004E-13,3.12E-9,-5.8599999999999998E-6,6.8300000000000001E-3,25.9,null,-1.2569999999999999E-7,1.0863931E-3,0,null,-1.036E-7,9.6983370000000005E-4,0,null,null,-4.2018000000000002E-6,-1.3241850000000001E-3,1.0346625890000001,null,null,-1.4999999999999999E-2,29.875]
["Vero 18","35E","F",4000,"BXRC",{"$f":"MasterTable[[#This Row],[Product Family]]&\"-\"&MasterTable[[#This Row],[CCT/CRI]]&MasterTable[[#This Row],[Arrangement]]","v":"Vero 18-35EF"},{"$f":"MasterTable[[#This Row],[Generation]]&\"-\"&MasterTable[[#This Row],[CCT/CRI]]&IF(MasterTable[[#This Row],[Lumen Family]]<999,\"0\"&MasterTable[[#This Row],[Lumen Family]],MasterTable[[#This Row],[Lumen Family]])&\"-\"&MasterTable[[#This Row],[Arrangement]]&\"-2x\"","v":"BXRC-35E4000-F-2x"},4150,0.13,29.5,1050,2100,60,-4.3296141676000001E-13,2.4210131023999999E-9,-5.0293161703999997E-6,6.8884526139999999E-3,25.523184017999998,null,-1.3106025059999999E-7,1.0878699984E-3,4.2883455537999996E-3,null,-1.211637044E-7,1.0744689300000001E-3,6.8809729823E-3,6.6426899999999999E-9,-1.4332000000000001E-6,1.01154E-4,-4.1218399999999999E-3,1.0607,null,null,-1.4999999999999999E-2,29.875]
["Vero 18","35G","F",4000,"BXRC",{"$f":"MasterTable[[#This Row],[Product Family]]&\"-\"&MasterTable[[#This Row],[CCT/CRI]]&MasterTable[[#This Row],[Arrangement]]","v":"Vero 18-35GF"},{"$f":"MasterTable[[#This Row],[Generation]]&\"-\"&MasterTable[[#This Row],[CCT/CRI]]&IF(MasterTable[[#This Row],[Lumen Family]]<999,\"0\"&MasterTable[[#This Row],[Lumen Family]],MasterTable[[#This Row],[Lumen Family]])&\"-\"&MasterTable[[#This Row],[Arrangement]]&\"-2x\"","v":"BXRC-35G4000-F-2x"},3655,0.13,29.5,1050,2100,60,-4.3296141676000001E-13,2.4210131023999999E-9,-5.0293161703999997E-6,6.8884526139999999E-3,25.523184017999998,null,-1.3106025059999999E-7,1.0878699984E-3,4.2883455537999996E-3,null,-1.211637044E-7,1.0744689300000001E-3,6.8809729823E-3,6.6426899999999999E-9,-1.4332000000000001E-6,1.01154E-4,-4.1218399999999999E-3,1.0607,null,null,-1.4999999999999999E-2,29.875]
["Vero 18","40A","F",4001,"BXRC",{"$f":"MasterTable[[#This Row],[Product Family]]&\"-\"&MasterTable[[#This Row],[CCT/CRI]]&MasterTable[[#This Row],[Arrangement]]","v":"Vero 18-40AF"},{"$f":"MasterTable[[#This Row],[Generation]]&\"-\"&MasterTable[[#This Row],[CCT/CRI]]&IF(MasterTable[[#This Row],[Lumen Family]]<999,\"0\"&MasterTable[[#This Row],[Lumen Family]],MasterTable[[#This Row],[Lumen Family]])&\"-\"&MasterTable[[#This Row],[Arrangement]]&\"-23\"","v":"BXRC-40A4001-F-23"},3385,0.13,29.5,1050,{"$f":"INDEX(FF_stats31333[],MATCH(A207,FF_stats31333[Form Factor],0),2)","v":2100},60,-6.0700000000000004E-13,3.12E-9,-5.8599999999999998E-6,6.8300000000000001E-3,25.9,null,-1.2569999999999999E-7,1.0863931E-3,0,null,-1.036E-7,9.6983370000000005E-4,0,null,null,-2.6140933490999999E-6,-1.4766242752000001E-3,1.0379504389,null,null,-1.4999999999999999E-2,29.875]
["Vero 18","40E","F",4000,"BXRC",{"$f":"MasterTable[[#This Row],[Product Family]]&\"-\"&MasterTable[[#This Row],[CCT/CRI]]&MasterTable[[#This Row],[Arrangement]]","v":"Vero 18-40EF"},{"$f":"MasterTable[[#This Row],[Generation]]&\"-\"&MasterTable[[#This Row],[CCT/CRI]]&IF(MasterTable[[#This Row],[Lumen Family]]<999,\"0\"&MasterTable[[#This Row],[Lumen Family]],MasterTable[[#This Row],[Lumen Family]])&\"-\"&MasterTable[[#This Row],[Arrangement]]&\"-2x\"","v":"BXRC-40E4000-F-2x"},4244,0.13,29.5,1050,2100,60,-4.3296141676000001E-13,2.4210131023999999E-9,-5.0293161703999997E-6,6.8884526139999999E-3,25.523184017999998,null,-1.3106025059999999E-7,1.0878699984E-3,4.2883455537999996E-3,null,-1.211637044E-7,1.0744689300000001E-3,6.8809729823E-3,null,-1.8425800000000001E-7,2.5068200000000002E-5,-2.5901499999999998E-3,1.05063,null,null,-1.4999999999999999E-2,29.875]
["Vero 18","40G","F",4000,"BXRC",{"$f":"MasterTable[[#This Row],[Product Family]]&\"-\"&MasterTable[[#This Row],[CCT/CRI]]&MasterTable[[#This Row],[Arrangement]]","v":"Vero 18-40GF"},{"$f":"MasterTable[[#This Row],[Generation]]&\"-\"&MasterTable[[#This Row],[CCT/CRI]]&IF(MasterTable[[#This Row],[Lumen Family]]<999,\"0\"&MasterTable[[#This Row],[Lumen Family]],MasterTable[[#This Row],[Lumen Family]])&\"-\"&MasterTable[[#This Row],[Arrangement]]&\"-2x\"","v":"BXRC-40G4000-F-2x"},3670,0.13,29.5,1050,{"$f":"INDEX(FF_stats31333[],MATCH(A209,FF_stats31333[Form Factor],0),2)","v":2100},60,-4.3296141676000001E-13,2.4210131023999999E-9,-5.0293161703999997E-6,6.8884526139999999E-3,25.523184017999998,null,-1.3106025059999999E-7,1.0878699984E-3,4.2883455537999996E-3,null,-1.211637044E-7,1.0744689300000001E-3,6.8809729823E-3,null,-1.8425800000000001E-7,2.5068200000000002E-5,-2.5901499999999998E-3,1.05063,null,null,-1.4999999999999999E-2,29.875]
["Vero 18","50C","F",4000,"BXRC",{"$f":"MasterTable[[#This Row],[Product Family]]&\"-\"&MasterTable[[#This Row],[CCT/CRI]]&MasterTable[[#This Row],[Arrangement]]","v":"Vero 18-50CF"},{"$f":"MasterTable[[#This Row],[Generation]]&\"-\"&MasterTable[[#This Row],[CCT/CRI]]&IF(MasterTable[[#This Row],[Lumen Family]]<999,\"0\"&MasterTable[[#This Row],[Lumen Family]],MasterTable[[#This Row],[Lumen Family]])&\"-\"&MasterTable[[#This Row],[Arrangement]]&\"-2x\"","v":"BXRC-50C4000-F-2x"},4491,0.13,29.5,1050,2100,60,-4.3296141676000001E-13,2.4210131023999999E-9,-5.0293161703999997E-6,6.8884526139999999E-3,25.523184017999998,null,-1.3106025059999999E-7,1.0878699984E-3,4.2883455537999996E-3,null,-1.211637044E-7,1.0744689300000001E-3,6.8809729823E-3,null,null,-3.9999999999999998E-6,-1.6000000000000001E-3,1.0421,null,null,-1.4999999999999999E-2,29.875]
["Vero 18","50E","F",4000,"BXRC",{"$f":"MasterTable[[#This Row],[Product Family]]&\"-\"&MasterTable[[#This Row],[CCT/CRI]]&MasterTable[[#This Row],[Arrangement]]","v":"Vero 18-50EF"},{"$f":"MasterTable[[#This Row],[Generation]]&\"-\"&MasterTable[[#This Row],[CCT/CRI]]&IF(MasterTable[[#This Row],[Lumen Family]]<999,\"0\"&MasterTable[[#This Row],[Lumen Family]],MasterTable[[#This Row],[Lumen Family]])&\"-\"&MasterTable[[#This Row],[Arrangement]]&\"-2x\"","v":"BXRC-50E4000-F-2x"},4275,0.13,29.5,1050,{"$f":"INDEX(FF_stats31333[],MATCH(A211,FF_stats31333[Form Factor],0),2)","v":2100},60,-4.3296141676000001E-13,2.4210131023999999E-9,-5.0293161703999997E-6,6.8884526139999999E-3,25.523184017999998,null,-1.3106025059999999E-7,1.0878699984E-3,4.2883455537999996E-3,null,-1.211637044E-7,1.0744689300000001E-3,6.8809729823E-3,null,null,-3.9999999999999998E-6,-1.6000000000000001E-3,1.0421,null,null,-1.4999999999999999E-2,29.875]
["Vero 18","50G","F",4000,"BXRC",{"$f":"MasterTable[[#This Row],[Product Family]]&\"-\"&MasterTable[[#This Row],[CCT/CRI]]&MasterTable[[#This Row],[Arrangement]]","v":"Vero 18-50GF"},{"$f":"MasterTable[[#This Row],[Generation]]&\"-\"&MasterTable[[#This Row],[CCT/CRI]]&IF(MasterTable[[#This Row],[Lumen Family]]<999,\"0\"&MasterTable[[#This Row],[Lumen Family]],MasterTable[[#This Row],[Lumen Family]])&\"-\"&MasterTable[[#This Row],[Arrangement]]&\"-2x\"","v":"BXRC-50G4000-F-2x"},3885,0.13,29.5,1050,{"$f":"INDEX(FF_stats31333[],MATCH(A212,FF_stats31333[Form Factor],0),2)","v":2100},60,-4.3296141676000001E-13,2.4210131023999999E-9,-5.0293161703999997E-6,6.8884526139999999E-3,25.523184017999998,null,-1.3106025059999999E-7,1.0878699984E-3,4.2883455537999996E-3,null,-1.211637044E-7,1.0744689300000001E-3,6.8809729823E-3,null,null,-3.9999999999999998E-6,-1.6000000000000001E-3,1.0421,null,null,-0.02,38.5]
["Vero 18","56G","F",4000,"BXRC",{"$f":"MasterTable[[#This Row],[Product Family]]&\"-\"&MasterTable[[#This Row],[CCT/CRI]]&MasterTable[[#This Row],[Arrangement]]","v":"Vero 18-56GF"},{"$f":"MasterTable[[#This Row],[Generation]]&\"-\"&MasterTable[[#This Row],[CCT/CRI]]&IF(MasterTable[[#This Row],[Lumen Family]]<999,\"0\"&MasterTable[[#This Row],[Lumen Family]],MasterTable[[#This Row],[Lumen Family]])&\"-\"&MasterTable[[#This Row],[Arrangement]]&\"-xx\"","v":"BXRC-56G4000-F-xx"},3888,0.13,29.5,1050,{"$f":"INDEX(FF_stats31333[],MATCH(A213,FF_stats31333[Form Factor],0),2)","v":2100},60,-4.3296141676000001E-13,2.4210131023999999E-9,-5.0293161703999997E-6,6.8884526139999999E-3,25.523184017999998,null,-9.7300000000000004E-8,1.0486146E-3,6.6521280999999998E-3,null,-1.211637044E-7,1.0744689300000001E-3,6.8809729823E-3,null,null,-4.4418000000000004E-6,-1.4565054E-3,1.0323070879,null,null,-1.4999999999999999E-2,29.875]
["Vero 29","17E","L","10K0","BXRC",{"$f":"MasterTable[[#This Row],[Product Family]]&\"-\"&MasterTable[[#This Row],[CCT/CRI]]&MasterTable[[#This Row],[Arrangement]]","v":"Vero 29-17EL"},"BXRC-17E10K0-L-xx",5406,0.06,38,2100,{"$f":"INDEX(FF_stats31333[],MATCH(A214,FF_stats31333[Form Factor],0),2)","v":3150},156,-5.0696360042000002E-14,5.0223240997000004E-10,-1.857052826E-6,4.6475978560999998E-3,32.803258485999997,null,-2.25E-8,5.2358190000000005E-4,-2.6490562E-3,null,null,null,null,null,null,-7.7627999999999996E-6,-8.7980209999999998E-4,1.0198635790999999,null,null,-0.02,38.5]
["Vero 29","25E","L","10K0","BXRC",{"$f":"MasterTable[[#This Row],[Product Family]]&\"-\"&MasterTable[[#This Row],[CCT/CRI]]&MasterTable[[#This Row],[Arrangement]]","v":"Vero 29-25EL"},"BXRC-25E10K0-L-xx",9298,0.06,38,2100,{"$f":"INDEX(FF_stats31333[],MATCH(A215,FF_stats31333[Form Factor],0),2)","v":3150},156,-5.0696360042000002E-14,5.0223240997000004E-10,-1.857052826E-6,4.6475978560999998E-3,32.803258485999997,null,-2.25E-8,5.2358190000000005E-4,-2.6490562E-3,null,null,null,null,null,null,-5.5898000000000003E-6,-1.5066861E-3,1.0339573339999999,null,null,-0.02,38.5]
["Vero 29","27E","L","10K0","BXRC",{"$f":"MasterTable[[#This Row],[Product Family]]&\"-\"&MasterTable[[#This Row],[CCT/CRI]]&MasterTable[[#This Row],[Arrangement]]","v":"Vero 29-27EL"},{"$f":"MasterTable[[#This Row],[Generation]]&\"-\"&MasterTable[[#This Row],[CCT/CRI]]&IF(MasterTable[[#This Row],[Lumen Family]]<999,\"0\"&MasterTable[[#This Row],[Lumen Family]],MasterTable[[#This Row],[Lumen Family]])&\"-\"&MasterTable[[#This Row],[Arrangement]]&\"-2x\"","v":"BXRC-27E10K0-L-2x"},9780,0.06,38,2100,4200,156,-5.0696360042000002E-14,5.0223240997000004E-10,-1.857052826E-6,4.6475978560999998E-3,32.803258485999997,null,-3.6683947658000001E-8,5.5936581253000002E-4,0,null,-3.3851040021000001E-8,5.4495228606999996E-4,4.7159190385999998E-3,-7.5070699999999998E-9,1.4229E-6,-8.7779200000000001E-5,4.1913900000000001E-4,1.02433,null,null,-0.02,38.5]
["Vero 29","27G","L","10K0","BXRC",{"$f":"MasterTable[[#This Row],[Product Family]]&\"-\"&MasterTable[[#This Row],[CCT/CRI]]&MasterTable[[#This Row],[Arrangement]]","v":"Vero 29-27GL"},{"$f":"MasterTable[[#This Row],[Generation]]&\"-\"&MasterTable[[#This Row],[CCT/CRI]]&IF(MasterTable[[#This Row],[Lumen Family]]<999,\"0\"&MasterTable[[#This Row],[Lumen Family]],MasterTable[[#This Row],[Lumen Family]])&\"-\"&MasterTable[[#This Row],[Arrangement]]&\"-2x\"","v":"BXRC-27G10K0-L-2x"},8299,0.06,38,2100,4200,156,-5.0696360042000002E-14,5.0223240997000004E-10,-1.857052826E-6,4.6475978560999998E-3,32.803258485999997,null,-3.6683947658000001E-8,5.5936581253000002E-4,0,null,-3.3851040021000001E-8,5.4495228606999996E-4,4.7159190385999998E-3,-7.5070699999999998E-9,1.4229E-6,-8.7779200000000001E-5,4.1913900000000001E-4,1.02433,null,null,-0.02,38.5]
["Vero 29","30A","L","10K1","BXRC",{"$f":"MasterTable[[#This Row],[Product Family]]&\"-\"&MasterTable[[#This Row],[CCT/CRI]]&MasterTable[[#This Row],[Arrangement]]","v":"Vero 29-30AL"},{"$f":"MasterTable[[#This Row],[Generation]]&\"-\"&MasterTable[[#This Row],[CCT/CRI]]&IF(MasterTable[[#This Row],[Lumen Family]]<999,\"0\"&MasterTable[[#This Row],[Lumen Family]],MasterTable[[#This Row],[Lumen Family]])&\"-\"&MasterTable[[#This Row],[Arrangement]]&\"-23\"","v":"BXRC-30A10K1-L-23"},7483,0.06,38,2100,4200,156,-4.4999999999999998E-14,4.6000000000000001E-10,-1.75E-6,4.1999999999999997E-3,33.5,null,-3.1E-8,5.4048789999999996E-4,0,null,-2.37E-8,4.789285E-4,0,null,null,-3.7351999999999998E-6,-1.3617582999999999E-3,1.0338120691999999,null,null,-0.02,38.5]
["Vero 29","30E","L","10K0","BXRC",{"$f":"MasterTable[[#This Row],[Product Family]]&\"-\"&MasterTable[[#This Row],[CCT/CRI]]&MasterTable[[#This Row],[Arrangement]]","v":"Vero 29-30EL"},{"$f":"MasterTable[[#This Row],[Generation]]&\"-\"&MasterTable[[#This Row],[CCT/CRI]]&IF(MasterTable[[#This Row],[Lumen Family]]<999,\"0\"&MasterTable[[#This Row],[Lumen Family]],MasterTable[[#This Row],[Lumen Family]])&\"-\"&MasterTable[[#This Row],[Arrangement]]&\"-2x\"","v":"BXRC-30E10K0-L-2x"},10475,0.06,38,2100,4200,156,-5.0696360042000002E-14,5.0223240997000004E-10,-1.857052826E-6,4.6475978560999998E-3,32.803258485999997,null,-3.6683947658000001E-8,5.5936581253000002E-4,0,null,-3.3851040021000001E-8,5.4495228606999996E-4,4.7159190385999998E-3,-7.5070699999999998E-9,1.4229E-6,-8.7779200000000001E-5,4.1913900000000001E-4,1.02433,null,null,-0.02,38.5]
["Vero 29","30G","L","10K0","BXRC",{"$f":"MasterTable[[#This Row],[Product Family]]&\"-\"&MasterTable[[#This Row],[CCT/CRI]]&MasterTable[[#This Row],[Arrangement]]","v":"Vero 29-30GL"},{"$f":"MasterTable[[#This Row],[Generation]]&\"-\"&MasterTable[[#This Row],[CCT/CRI]]&IF(MasterTable[[#This Row],[Lumen Family]]<999,\"0\"&MasterTable[[#This Row],[Lumen Family]],MasterTable[[#This Row],[Lumen Family]])&\"-\"&MasterTable[[#This Row],[Arrangement]]&\"-2x\"","v":"BXRC-30G10K0-L-2x"},8698,0.06,38,2100,4200,156,-5.0696360042000002E-14,5.0223240997000004E-10,-1.857052826E-6,4.6475978560999998E-3,32.803258485999997,null,-3.6683947658000001E-8,5.5936581253000002E-4,0,null,-3.3851040021000001E-8,5.4495228606999996E-4,4.7159190385999998E-3,-7.5070699999999998E-9,1.4229E-6,-8.7779200000000001E-5,4.1913900000000001E-4,1.02433,null,null,-0.02,38.5]
["Vero 29","35A","L","10K1","BXRC",{"$f":"MasterTable[[#This Row],[Product Family]]&\"-\"&MasterTable[[#This Row],[CCT/CRI]]&MasterTable[[#This Row],[Arrangement]]","v":"Vero 29-35AL"},{"$f":"MasterTable[[#This Row],[Generation]]&\"-\"&MasterTable[[#This Row],[CCT/CRI]]&IF(MasterTable[[#This Row],[Lumen Family]]<999,\"0\"&MasterTable[[#This Row],[Lumen Family]],MasterTable[[#This Row],[Lumen Family]])&\"-\"&MasterTable[[#This Row],[Arrangement]]&\"-23\"","v":"BXRC-35A10K1-L-23"},8251,0.06,38,2100,4200,156,-4.4999999999999998E-14,4.6000000000000001E-10,-1.75E-6,4.1999999999999997E-3,33.5,null,-3.1E-8,5.4048789999999996E-4,0,null,-2.37E-8,4.789285E-4,0,null,null,-3.7351999999999998E-6,-1.3617582999999999E-3,1.0338120691999999,null,null,-0.02,38.5]
["Vero 29","35E","L","10K0","BXRC",{"$f":"MasterTable[[#This Row],[Product Family]]&\"-\"&MasterTable[[#This Row],[CCT/CRI]]&MasterTable[[#This Row],[Arrangement]]","v":"Vero 29-35EL"},{"$f":"MasterTable[[#This Row],[Generation]]&\"-\"&MasterTable[[#This Row],[CCT/CRI]]&IF(MasterTable[[#This Row],[Lumen Family]]<999,\"0\"&MasterTable[[#This Row],[Lumen Family]],MasterTable[[#This Row],[Lumen Family]])&\"-\"&MasterTable[[#This Row],[Arrangement]]&\"-2x\"","v":"BXRC-35E10K0-L-2x"},10693,0.06,38,2100,4200,156,-5.0696360042000002E-14,5.0223240997000004E-10,-1.857052826E-6,4.6475978560999998E-3,32.803258485999997,null,-3.6683947658000001E-8,5.5936581253000002E-4,0,null,-3.3851040021000001E-8,5.4495228606999996E-4,4.7159190385999998E-3,-7.5070699999999998E-9,1.4229E-6,-8.7779200000000001E-5,4.1913900000000001E-4,1.02433,null,null,-0.02,38.5]
["Vero 29","35G","L","10K0","BXRC",{"$f":"MasterTable[[#This Row],[Product Family]]&\"-\"&MasterTable[[#This Row],[CCT/CRI]]&MasterTable[[#This Row],[Arrangement]]","v":"Vero 29-35GL"},{"$f":"MasterTable[[#This Row],[Generation]]&\"-\"&MasterTable[[#This Row],[CCT/CRI]]&IF(MasterTable[[#This Row],[Lumen Family]]<999,\"0\"&MasterTable[[#This Row],[Lumen Family]],MasterTable[[#This Row],[Lumen Family]])&\"-\"&MasterTable[[#This Row],[Arrangement]]&\"-2x\"","v":"BXRC-35G10K0-L-2x"},9257,0.06,38,2100,4200,156,-5.0696360042000002E-14,5.0223240997000004E-10,-1.857052826E-6,4.6475978560999998E-3,32.803258485999997,null,-3.6683947658000001E-8,5.5936581253000002E-4,0,null,-3.3851040021000001E-8,5.4495228606999996E-4,4.7159190385999998E-3,-7.5070699999999998E-9,1.4229E-6,-8.7779200000000001E-5,4.1913900000000001E-4,1.02433,null,null,-0.02,38.5]
["Vero 29","40A","L","10K1","BXRC",{"$f":"MasterTable[[#This Row],[Product Family]]&\"-\"&MasterTable[[#This Row],[CCT/CRI]]&MasterTable[[#This Row],[Arrangement]]","v":"Vero 29-40AL"},{"$f":"MasterTable[[#This Row],[Generation]]&\"-\"&MasterTable[[#This Row],[CCT/CRI]]&IF(MasterTable[[#This Row],[Lumen Family]]<999,\"0\"&MasterTable[[#This Row],[Lumen Family]],MasterTable[[#This Row],[Lumen Family]])&\"-\"&MasterTable[[#This Row],[Arrangement]]&\"-23\"","v":"BXRC-40A10K1-L-23"},8666,0.06,38,2100,4200,156,-4.4999999999999998E-14,4.6000000000000001E-10,-1.75E-6,4.1999999999999997E-3,33.5,null,-3.1E-8,5.4048789999999996E-4,0,null,-2.37E-8,4.789285E-4,0,null,null,-4.1196000000000003E-6,-1.3501874E-3,1.0351797846999999,null,null,-0.02,38.5]
["Vero 29","40E","L","10K0","BXRC",{"$f":"MasterTable[[#This Row],[Product Family]]&\"-\"&MasterTable[[#This Row],[CCT/CRI]]&MasterTable[[#This Row],[Arrangement]]","v":"Vero 29-40EL"},{"$f":"MasterTable[[#This Row],[Generation]]&\"-\"&MasterTable[[#This Row],[CCT/CRI]]&IF(MasterTable[[#This Row],[Lumen Family]]<999,\"0\"&MasterTable[[#This Row],[Lumen Family]],MasterTable[[#This Row],[Lumen Family]])&\"-\"&MasterTable[[#This Row],[Arrangement]]&\"-2x\"","v":"BXRC-40E10K0-L-2x"},10933,0.06,38,2100,4200,156,-5.0696360042000002E-14,5.0223240997000004E-10,-1.857052826E-6,4.6475978560999998E-3,32.803258485999997,null,-3.6683947658000001E-8,5.5936581253000002E-4,0,null,-3.3851040021000001E-8,5.4495228606999996E-4,4.7159190385999998E-3,-4.0380200000000001E-9,6.48277E-7,-3.1828400000000002E-5,-1.1693700000000001E-3,1.0407900000000001,null,null,-0.02,38.5]
["Vero 29","40G","L","10K0","BXRC",{"$f":"MasterTable[[#This Row],[Product Family]]&\"-\"&MasterTable[[#This Row],[CCT/CRI]]&MasterTable[[#This Row],[Arrangement]]","v":"Vero 29-40GL"},{"$f":"MasterTable[[#This Row],[Generation]]&\"-\"&MasterTable[[#This Row],[CCT/CRI]]&IF(MasterTable[[#This Row],[Lumen Family]]<999,\"0\"&MasterTable[[#This Row],[Lumen Family]],MasterTable[[#This Row],[Lumen Family]])&\"-\"&MasterTable[[#This Row],[Arrangement]]&\"-2x\"","v":"BXRC-40G10K0-L-2x"},9415,0.06,38,2100,4200,156,-5.0696360042000002E-14,5.0223240997000004E-10,-1.857052826E-6,4.6475978560999998E-3,32.803258485999997,null,-3.6683947658000001E-8,5.5936581253000002E-4,0,null,-3.3851040021000001E-8,5.4495228606999996E-4,4.7159190385999998E-3,-4.0380200000000001E-9,6.48277E-7,-3.1828400000000002E-5,-1.1693700000000001E-3,1.0407900000000001,null,null,-0.02,38.5]
["Vero 29","50C","L","10K0","BXRC",{"$f":"MasterTable[[#This Row],[Product Family]]&\"-\"&MasterTable[[#This Row],[CCT/CRI]]&MasterTable[[#This Row],[Arrangement]]","v":"Vero 29-50CL"},{"$f":"MasterTable[[#This Row],[Generation]]&\"-\"&MasterTable[[#This Row],[CCT/CRI]]&IF(MasterTable[[#This Row],[Lumen Family]]<999,\"0\"&MasterTable[[#This Row],[Lumen Family]],MasterTable[[#This Row],[Lumen Family]])&\"-\"&MasterTable[[#This Row],[Arrangement]]&\"-2x\"","v":"BXRC-50C10K0-L-2x"},11571,0.06,38,2100,4200,156,-5.0696360042000002E-14,5.0223240997000004E-10,-1.857052826E-6,4.6475978560999998E-3,32.803258485999997,null,-3.6683947658000001E-8,5.5936581253000002E-4,0,null,-3.3851040021000001E-8,5.4495228606999996E-4,4.7159190385999998E-3,null,null,-3.9999999999999998E-6,-1.6000000000000001E-3,1.0421,null,null,-0.02,38.5]
["Vero 29","50E","L","10K0","BXRC",{"$f":"MasterTable[[#This Row],[Product Family]]&\"-\"&MasterTable[[#This Row],[CCT/CRI]]&MasterTable[[#This Row],[Arrangement]]","v":"Vero 29-50EL"},{"$f":"MasterTable[[#This Row],[Generation]]&\"-\"&MasterTable[[#This Row],[CCT/CRI]]&IF(MasterTable[[#This Row],[Lumen Family]]<999,\"0\"&MasterTable[[#This Row],[Lumen Family]],MasterTable[[#This Row],[Lumen Family]])&\"-\"&MasterTable[[#This Row],[Arrangement]]&\"-2x\"","v":"BXRC-50E10K0-L-2x"},11012,0.06,38,2100,4200,156,-5.0696360042000002E-14,5.0223240997000004E-10,-1.857052826E-6,4.6475978560999998E-3,32.803258485999997,null,-3.6683947658000001E-8,5.5936581253000002E-4,0,null,-3.3851040021000001E-8,5.4495228606999996E-4,4.7159190385999998E-3,null,null,-3.9999999999999998E-6,-1.6000000000000001E-3,1.0421,null,null,-0.02,38.5]
["Vero 29","50G","L","10K0","BXRC",{"$f":"MasterTable[[#This Row],[Product Family]]&\"-\"&MasterTable[[#This Row],[CCT/CRI]]&MasterTable[[#This Row],[Arrangement]]","v":"Vero 29-50GL"},{"$f":"MasterTable[[#This Row],[Generation]]&\"-\"&MasterTable[[#This Row],[CCT/CRI]]&IF(MasterTable[[#This Row],[Lumen Family]]<999,\"0\"&MasterTable[[#This Row],[Lumen Family]],MasterTable[[#This Row],[Lumen Family]])&\"-\"&MasterTable[[#This Row],[Arrangement]]&\"-2x\"","v":"BXRC-50G10K0-L-2x"},10010,0.06,38,2100,4200,156,-5.0696360042000002E-14,5.0223240997000004E-10,-1.857052826E-6,4.6475978560999998E-3,32.803258485999997,null,-3.6683947658000001E-8,5.5936581253000002E-4,0,null,-3.3851040021000001E-8,5.4495228606999996E-4,4.7159190385999998E-3,null,null,-3.9999999999999998E-6,-1.6000000000000001E-3,1.0421,null,null,-0.02,38.5]
["Vero 29","56G","L","10K0","BXRC",{"$f":"MasterTable[[#This Row],[Product Family]]&\"-\"&MasterTable[[#This Row],[CCT/CRI]]&MasterTable[[#This Row],[Arrangement]]","v":"Vero 29-56GL"},{"$f":"MasterTable[[#This Row],[Generation]]&\"-\"&MasterTable[[#This Row],[CCT/CRI]]&IF(MasterTable[[#This Row],[Lumen Family]]<999,\"0\"&MasterTable[[#This Row],[Lumen Family]],MasterTable[[#This Row],[Lumen Family]])&\"-\"&MasterTable[[#This Row],[Arrangement]]&\"-xx\"","v":"BXRC-56G10K0-L-xx"},9948,0.06,38,2100,4200,156,-5.0696360042000002E-14,5.0223240997000004E-10,-1.857052826E-6,4.6475978560999998E-3,32.803258485999997,null,-2.25E-8,5.2358190000000005E-4,-2.6490562E-3,null,-3.3851040021000001E-8,5.4495228606999996E-4,4.7159190385999998E-3,null,null,-3.76E-6,-1.6000000000000001E-3,1.04,null,null,-0.02,38.5]
["H6","27E","C",1000,"BXRH",{"$f":"MasterTable[[#This Row],[Product Family]]&\"-\"&MasterTable[[#This Row],[CCT/CRI]]&MasterTable[[#This Row],[Arrangement]]","v":"H6-27EC"},{"$f":"MasterTable[[#This Row],[Generation]]&\"-\"&MasterTable[[#This Row],[CCT/CRI]]&IF(MasterTable[[#This Row],[Lumen Family]]<999,\"0\"&MasterTable[[#This Row],[Lumen Family]],MasterTable[[#This Row],[Lumen Family]])&\"-\"&MasterTable[[#This Row],[Arrangement]]&\"-xx\"","v":"BXRH-27E1000-C-xx"},1200,0.6,18.3,750,1050,18,-8.2400000000000002E-13,3.1294820000000001E-9,-5.2983031360000001E-6,6.3487178389670003E-3,15.458040595297801,null,-2.8099999999999999E-7,1.5249584E-3,1.8411588400000001E-2,null,null,null,null,null,null,-6.6139000000000003E-6,-1.1886867E-3,1.0306850599999999,null,null,-1.3758559300000001E-2,18.643963981700001]
["H6","30E","C",1000,"BXRH",{"$f":"MasterTable[[#This Row],[Product Family]]&\"-\"&MasterTable[[#This Row],[CCT/CRI]]&MasterTable[[#This Row],[Arrangement]]","v":"H6-30EC"},{"$f":"MasterTable[[#This Row],[Generation]]&\"-\"&MasterTable[[#This Row],[CCT/CRI]]&IF(MasterTable[[#This Row],[Lumen Family]]<999,\"0\"&MasterTable[[#This Row],[Lumen Family]],MasterTable[[#This Row],[Lumen Family]])&\"-\"&MasterTable[[#This Row],[Arrangement]]&\"-xx\"","v":"BXRH-30E1000-C-xx"},1260,0.6,18.3,750,1050,18,-8.2400000000000002E-13,3.1294820000000001E-9,-5.2983031360000001E-6,6.3487178389670003E-3,15.458040595297801,null,-2.8099999999999999E-7,1.5249584E-3,1.8411588400000001E-2,null,null,null,null,null,null,-6.6139000000000003E-6,-1.1886867E-3,1.0306850599999999,null,null,-1.3758559300000001E-2,18.643963981700001]
["H6","30G","C",1000,"BXRH",{"$f":"MasterTable[[#This Row],[Product Family]]&\"-\"&MasterTable[[#This Row],[CCT/CRI]]&MasterTable[[#This Row],[Arrangement]]","v":"H6-30GC"},{"$f":"MasterTable[[#This Row],[Generation]]&\"-\"&MasterTable[[#This Row],[CCT/CRI]]&IF(MasterTable[[#This Row],[Lumen Family]]<999,\"0\"&MasterTable[[#This Row],[Lumen Family]],MasterTable[[#This Row],[Lumen Family]])&\"-\"&MasterTable[[#This Row],[Arrangement]]&\"-xx\"","v":"BXRH-30G1000-C-xx"},1000,0.6,18.3,750,1050,18,-8.2400000000000002E-13,3.1294820000000001E-9,-5.2983031360000001E-6,6.3487178389670003E-3,15.458040595297801,null,-2.8099999999999999E-7,1.5249584E-3,1.8411588400000001E-2,null,null,null,null,null,null,-6.6139000000000003E-6,-1.1886867E-3,1.0306850599999999,null,null,-1.3758559300000001E-2,18.643963981700001]
["H6","35A","C",1001,"BXRH",{"$f":"MasterTable[[#This Row],[Product Family]]&\"-\"&MasterTable[[#This Row],[CCT/CRI]]&MasterTable[[#This Row],[Arrangement]]","v":"H6-35AC"},{"$f":"MasterTable[[#This Row],[Generation]]&\"-\"&MasterTable[[#This Row],[CCT/CRI]]&IF(MasterTable[[#This Row],[Lumen Family]]<999,\"0\"&MasterTable[[#This Row],[Lumen Family]],MasterTable[[#This Row],[Lumen Family]])&\"-\"&MasterTable[[#This Row],[Arrangement]]&\"-xx\"","v":"BXRH-35A1001-C-xx"},990,0.6,18.3,750,1050,18,-8.2400000000000002E-13,3.1294820000000001E-9,-5.2983031360000001E-6,6.3487178389670003E-3,15.458040595297801,null,-2.8099999999999999E-7,1.5249584E-3,1.8411588400000001E-2,null,null,null,null,null,null,-6.6139000000000003E-6,-1.1886867E-3,1.0306850599999999,null,null,-1.3758559300000001E-2,18.643963981700001]
["H6","40E","C",1000,"BXRH",{"$f":"MasterTable[[#This Row],[Product Family]]&\"-\"&MasterTable[[#This Row],[CCT/CRI]]&MasterTable[[#This Row],[Arrangement]]","v":"H6-40EC"},{"$f":"MasterTable[[#This Row],[Generation]]&\"-\"&MasterTable[[#This Row],[CCT/CRI]]&IF(MasterTable[[#This Row],[Lumen Family]]<999,\"0\"&MasterTable[[#This Row],[Lumen Family]],MasterTable[[#This Row],[Lumen Family]])&\"-\"&MasterTable[[#This Row],[Arrangement]]&\"-xx\"","v":"BXRH-40E1000-C-xx"},1375,0.6,18.3,750,1050,18,-8.2400000000000002E-13,3.1294820000000001E-9,-5.2983031360000001E-6,6.3487178389670003E-3,15.458040595297801,null,-2.8099999999999999E-7,1.5249584E-3,1.8411588400000001E-2,null,null,null,null,null,null,-6.6139000000000003E-6,-1.1886867E-3,1.0306850599999999,null,null,-1.3758559300000001E-2,18.643963981700001]
["H9","27E","D",3000,"BXRH",{"$f":"MasterTable[[#This Row],[Product Family]]&\"-\"&MasterTable[[#This Row],[CCT/CRI]]&MasterTable[[#This Row],[Arrangement]]","v":"H9-27ED"},{"$f":"MasterTable[[#This Row],[Generation]]&\"-\"&MasterTable[[#This Row],[CCT/CRI]]&IF(MasterTable[[#This Row],[Lumen Family]]<999,\"0\"&MasterTable[[#This Row],[Lumen Family]],MasterTable[[#This Row],[Lumen Family]])&\"-\"&MasterTable[[#This Row],[Arrangement]]&\"-xx\"","v":"BXRH-27E3000-D-xx"},3150,0.22,36.6,1000,1400,48,-7.83E-13,3.5124290000000001E-9,-6.8740996870000002E-6,9.4334499859520006E-3,31.3107659284749,null,-1.7070000000000001E-7,1.1571101000000001E-3,1.6376991899999999E-2,null,null,null,null,null,5.5899999999999998E-8,-1.5137600000000001E-5,-7.8742730000000004E-4,1.0157305555,null,null,-2.5475177599999999E-2,37.236879440000003]
["H9","30E","D",3000,"BXRH",{"$f":"MasterTable[[#This Row],[Product Family]]&\"-\"&MasterTable[[#This Row],[CCT/CRI]]&MasterTable[[#This Row],[Arrangement]]","v":"H9-30ED"},{"$f":"MasterTable[[#This Row],[Generation]]&\"-\"&MasterTable[[#This Row],[CCT/CRI]]&IF(MasterTable[[#This Row],[Lumen Family]]<999,\"0\"&MasterTable[[#This Row],[Lumen Family]],MasterTable[[#This Row],[Lumen Family]])&\"-\"&MasterTable[[#This Row],[Arrangement]]&\"-xx\"","v":"BXRH-30E3000-D-xx"},3350,0.22,36.6,1000,1400,48,-7.83E-13,3.5124290000000001E-9,-6.8740996870000002E-6,9.4334499859520006E-3,31.3107659284749,null,-1.7070000000000001E-7,1.1571101000000001E-3,1.6376991899999999E-2,null,null,null,null,null,5.5899999999999998E-8,-1.5137600000000001E-5,-7.8742730000000004E-4,1.0157305555,null,null,-2.5475177599999999E-2,37.236879440000003]
["H9","30G","D",3000,"BXRH",{"$f":"MasterTable[[#This Row],[Product Family]]&\"-\"&MasterTable[[#This Row],[CCT/CRI]]&MasterTable[[#This Row],[Arrangement]]","v":"H9-30GD"},{"$f":"MasterTable[[#This Row],[Generation]]&\"-\"&MasterTable[[#This Row],[CCT/CRI]]&IF(MasterTable[[#This Row],[Lumen Family]]<999,\"0\"&MasterTable[[#This Row],[Lumen Family]],MasterTable[[#This Row],[Lumen Family]])&\"-\"&MasterTable[[#This Row],[Arrangement]]&\"-xx\"","v":"BXRH-30G3000-D-xx"},2675,0.22,36.6,1000,1400,48,-7.83E-13,3.5124290000000001E-9,-6.8740996870000002E-6,9.4334499859520006E-3,31.3107659284749,null,-1.7070000000000001E-7,1.1571101000000001E-3,1.6376991899999999E-2,null,null,null,null,null,5.5899999999999998E-8,-1.5137600000000001E-5,-7.8742730000000004E-4,1.0157305555,null,null,-2.5475177599999999E-2,37.236879440000003]
["H9","35A","D",3001,"BXRH",{"$f":"MasterTable[[#This Row],[Product Family]]&\"-\"&MasterTable[[#This Row],[CCT/CRI]]&MasterTable[[#This Row],[Arrangement]]","v":"H9-35AD"},{"$f":"MasterTable[[#This Row],[Generation]]&\"-\"&MasterTable[[#This Row],[CCT/CRI]]&IF(MasterTable[[#This Row],[Lumen Family]]<999,\"0\"&MasterTable[[#This Row],[Lumen Family]],MasterTable[[#This Row],[Lumen Family]])&\"-\"&MasterTable[[#This Row],[Arrangement]]&\"-xx\"","v":"BXRH-35A3001-D-xx"},2650,0.22,36.6,1000,1400,48,-7.83E-13,3.5124290000000001E-9,-6.8740996870000002E-6,9.4334499859520006E-3,31.3107659284749,null,-1.7070000000000001E-7,1.1571101000000001E-3,1.6376991899999999E-2,null,null,null,null,null,5.5899999999999998E-8,-1.5137600000000001E-5,-7.8742730000000004E-4,1.0157305555,null,null,-2.5475177599999999E-2,37.236879440000003]
["H9","40E","D",3000,"BXRH",{"$f":"MasterTable[[#This Row],[Product Family]]&\"-\"&MasterTable[[#This Row],[CCT/CRI]]&MasterTable[[#This Row],[Arrangement]]","v":"H9-40ED"},{"$f":"MasterTable[[#This Row],[Generation]]&\"-\"&MasterTable[[#This Row],[CCT/CRI]]&IF(MasterTable[[#This Row],[Lumen Family]]<999,\"0\"&MasterTable[[#This Row],[Lumen Family]],MasterTable[[#This Row],[Lumen Family]])&\"-\"&MasterTable[[#This Row],[Arrangement]]&\"-xx\"","v":"BXRH-40E3000-D-xx"},3650,0.22,36.6,1000,1400,48,-7.83E-13,3.5124290000000001E-9,-6.8740996870000002E-6,9.4334499859520006E-3,31.3107659284749,null,-1.7070000000000001E-7,1.1571101000000001E-3,1.6376991899999999E-2,null,null,null,null,null,5.5899999999999998E-8,-1.5137600000000001E-5,-7.8742730000000004E-4,1.0157305555,null,null,-2.5475177599999999E-2,37.236879440000003]
["H12","27E","G",6000,"BXRH",{"$f":"MasterTable[[#This Row],[Product Family]]&\"-\"&MasterTable[[#This Row],[CCT/CRI]]&MasterTable[[#This Row],[Arrangement]]","v":"H12-27EG"},{"$f":"MasterTable[[#This Row],[Generation]]&\"-\"&MasterTable[[#This Row],[CCT/CRI]]&IF(MasterTable[[#This Row],[Lumen Family]]<999,\"0\"&MasterTable[[#This Row],[Lumen Family]],MasterTable[[#This Row],[Lumen Family]])&\"-\"&MasterTable[[#This Row],[Arrangement]]&\"-xx\"","v":"BXRH-27E6000-G-xx"},5600,0.13,36.6,1750,2200,84,1.1927600000000001E-15,1.1745497183000001E-10,-1.0011727782096201E-6,4.4659681112195803E-3,31.215126819400499,null,-5.1E-8,6.5365669999999999E-4,1.4934355700000001E-2,null,null,null,null,null,4.0900000000000002E-8,-1.28136E-5,-1.0149071E-3,1.0211873234,null,null,-2.7718353099999999E-2,37.2929588278]
["H12","30E","G",6000,"BXRH",{"$f":"MasterTable[[#This Row],[Product Family]]&\"-\"&MasterTable[[#This Row],[CCT/CRI]]&MasterTable[[#This Row],[Arrangement]]","v":"H12-30EG"},{"$f":"MasterTable[[#This Row],[Generation]]&\"-\"&MasterTable[[#This Row],[CCT/CRI]]&IF(MasterTable[[#This Row],[Lumen Family]]<999,\"0\"&MasterTable[[#This Row],[Lumen Family]],MasterTable[[#This Row],[Lumen Family]])&\"-\"&MasterTable[[#This Row],[Arrangement]]&\"-xx\"","v":"BXRH-30E6000-G-xx"},5900,0.13,36.6,1750,2200,84,1.1927600000000001E-15,1.1745497183000001E-10,-1.0011727782096201E-6,4.4659681112195803E-3,31.215126819400499,null,-5.1E-8,6.5365669999999999E-4,1.4934355700000001E-2,null,null,null,null,null,4.0900000000000002E-8,-1.28136E-5,-1.0149071E-3,1.0211873234,null,null,-2.7718353099999999E-2,37.2929588278]
["H12","30G","G",6000,"BXRH",{"$f":"MasterTable[[#This Row],[Product Family]]&\"-\"&MasterTable[[#This Row],[CCT/CRI]]&MasterTable[[#This Row],[Arrangement]]","v":"H12-30GG"},{"$f":"MasterTable[[#This Row],[Generation]]&\"-\"&MasterTable[[#This Row],[CCT/CRI]]&IF(MasterTable[[#This Row],[Lumen Family]]<999,\"0\"&MasterTable[[#This Row],[Lumen Family]],MasterTable[[#This Row],[Lumen Family]])&\"-\"&MasterTable[[#This Row],[Arrangement]]&\"-xx\"","v":"BXRH-30G6000-G-xx"},4900,0.13,36.6,1750,2200,84,1.1927600000000001E-15,1.1745497183000001E-10,-1.0011727782096201E-6,4.4659681112195803E-3,31.215126819400499,null,-5.1E-8,6.5365669999999999E-4,1.4934355700000001E-2,null,null,null,null,null,4.0900000000000002E-8,-1.28136E-5,-1.0149071E-3,1.0211873234,null,null,-2.7718353099999999E-2,37.2929588278]
["H12","35A","G",6001,"BXRH",{"$f":"MasterTable[[#This Row],[Product Family]]&\"-\"&MasterTable[[#This Row],[CCT/CRI]]&MasterTable[[#This Row],[Arrangement]]","v":"H12-35AG"},{"$f":"MasterTable[[#This Row],[Generation]]&\"-\"&MasterTable[[#This Row],[CCT/CRI]]&IF(MasterTable[[#This Row],[Lumen Family]]<999,\"0\"&MasterTable[[#This Row],[Lumen Family]],MasterTable[[#This Row],[Lumen Family]])&\"-\"&MasterTable[[#This Row],[Arrangement]]&\"-xx\"","v":"BXRH-35A6001-G-xx"},4700,0.13,36.6,1750,2200,84,1.1927600000000001E-15,1.1745497183000001E-10,-1.0011727782096201E-6,4.4659681112195803E-3,31.215126819400499,null,-5.1E-8,6.5365669999999999E-4,1.4934355700000001E-2,null,null,null,null,null,4.0900000000000002E-8,-1.28136E-5,-1.0149071E-3,1.0211873234,null,null,-2.7718353099999999E-2,37.2929588278]
["H12","40E","G",6000,"BXRH",{"$f":"MasterTable[[#This Row],[Product Family]]&\"-\"&MasterTable[[#This Row],[CCT/CRI]]&MasterTable[[#This Row],[Arrangement]]","v":"H12-40EG"},{"$f":"MasterTable[[#This Row],[Generation]]&\"-\"&MasterTable[[#This Row],[CCT/CRI]]&IF(MasterTable[[#This Row],[Lumen Family]]<999,\"0\"&MasterTable[[#This Row],[Lumen Family]],MasterTable[[#This Row],[Lumen Family]])&\"-\"&MasterTable[[#This Row],[Arrangement]]&\"-xx\"","v":"BXRH-40E6000-G-xx"},6400,0.13,36.6,1750,2200,84,1.1927600000000001E-15,1.1745497183000001E-10,-1.0011727782096201E-6,4.4659681112195803E-3,31.215126819400499,null,-5.1E-8,6.5365669999999999E-4,1.4934355700000001E-2,null,null,null,null,null,4.0900000000000002E-8,-1.28136E-5,-1.0149071E-3,1.0211873234,null,null,-2.7718353099999999E-2,37.2929588278]
["H15","27E","J",8000,"BXRH",{"$f":"MasterTable[[#This Row],[Product Family]]&\"-\"&MasterTable[[#This Row],[CCT/CRI]]&MasterTable[[#This Row],[Arrangement]]","v":"H15-27EJ"},{"$f":"MasterTable[[#This Row],[Generation]]&\"-\"&MasterTable[[#This Row],[CCT/CRI]]&IF(MasterTable[[#This Row],[Lumen Family]]<999,\"0\"&MasterTable[[#This Row],[Lumen Family]],MasterTable[[#This Row],[Lumen Family]])&\"-\"&MasterTable[[#This Row],[Arrangement]]&\"-xx\"","v":"BXRH-27E8000-J-xx"},7900,0.1,36.6,2500,3150,120,-2.385258E-14,2.3318505057999999E-10,-9.9249446937586004E-7,3.5308675524008599E-3,31.259636895079101,null,-2.1600000000000002E-8,4.4538420000000002E-4,2.57949744E-2,null,null,null,null,null,null,-9.4318000000000001E-6,-9.9051580000000003E-4,1.024579498,null,null,-2.4361365900000001E-2,37.209034146400001]
["H15","30E","J",8000,"BXRH",{"$f":"MasterTable[[#This Row],[Product Family]]&\"-\"&MasterTable[[#This Row],[CCT/CRI]]&MasterTable[[#This Row],[Arrangement]]","v":"H15-30EJ"},{"$f":"MasterTable[[#This Row],[Generation]]&\"-\"&MasterTable[[#This Row],[CCT/CRI]]&IF(MasterTable[[#This Row],[Lumen Family]]<999,\"0\"&MasterTable[[#This Row],[Lumen Family]],MasterTable[[#This Row],[Lumen Family]])&\"-\"&MasterTable[[#This Row],[Arrangement]]&\"-xx\"","v":"BXRH-30E8000-J-xx"},8400,0.1,36.6,2500,3150,120,-2.385258E-14,2.3318505057999999E-10,-9.9249446937586004E-7,3.5308675524008599E-3,31.259636895079101,null,-2.1600000000000002E-8,4.4538420000000002E-4,2.57949744E-2,null,null,null,null,null,null,-9.4318000000000001E-6,-9.9051580000000003E-4,1.024579498,null,null,-2.4361365900000001E-2,37.209034146400001]
["H15","30G","J",8000,"BXRH",{"$f":"MasterTable[[#This Row],[Product Family]]&\"-\"&MasterTable[[#This Row],[CCT/CRI]]&MasterTable[[#This Row],[Arrangement]]","v":"H15-30GJ"},{"$f":"MasterTable[[#This Row],[Generation]]&\"-\"&MasterTable[[#This Row],[CCT/CRI]]&IF(MasterTable[[#This Row],[Lumen Family]]<999,\"0\"&MasterTable[[#This Row],[Lumen Family]],MasterTable[[#This Row],[Lumen Family]])&\"-\"&MasterTable[[#This Row],[Arrangement]]&\"-xx\"","v":"BXRH-30G8000-J-xx"},6840,0.1,36.6,2500,3150,120,-2.385258E-14,2.3318505057999999E-10,-9.9249446937586004E-7,3.5308675524008599E-3,31.259636895079101,null,-2.1600000000000002E-8,4.4538420000000002E-4,2.57949744E-2,null,null,null,null,null,null,-9.4318000000000001E-6,-9.9051580000000003E-4,1.024579498,null,null,-2.4361365900000001E-2,37.209034146400001]
["H15","35A","J",8001,"BXRH",{"$f":"MasterTable[[#This Row],[Product Family]]&\"-\"&MasterTable[[#This Row],[CCT/CRI]]&MasterTable[[#This Row],[Arrangement]]","v":"H15-35AJ"},{"$f":"MasterTable[[#This Row],[Generation]]&\"-\"&MasterTable[[#This Row],[CCT/CRI]]&IF(MasterTable[[#This Row],[Lumen Family]]<999,\"0\"&MasterTable[[#This Row],[Lumen Family]],MasterTable[[#This Row],[Lumen Family]])&\"-\"&MasterTable[[#This Row],[Arrangement]]&\"-xx\"","v":"BXRH-35A8001-J-xx"},6700,0.1,36.6,2500,3150,120,-2.385258E-14,2.3318505057999999E-10,-9.9249446937586004E-7,3.5308675524008599E-3,31.259636895079101,null,-2.1600000000000002E-8,4.4538420000000002E-4,2.57949744E-2,null,null,null,null,null,null,-9.4318000000000001E-6,-9.9051580000000003E-4,1.024579498,null,null,-2.4361365900000001E-2,37.209034146400001]
["H15","40E","J",8000,"BXRH",{"$f":"MasterTable[[#This Row],[Product Family]]&\"-\"&MasterTable[[#This Row],[CCT/CRI]]&MasterTable[[#This Row],[Arrangement]]","v":"H15-40EJ"},{"$f":"MasterTable[[#This Row],[Generation]]&\"-\"&MasterTable[[#This Row],[CCT/CRI]]&IF(MasterTable[[#This Row],[Lumen Family]]<999,\"0\"&MasterTable[[#This Row],[Lumen Family]],MasterTable[[#This Row],[Lumen Family]])&\"-\"&MasterTable[[#This Row],[Arrangement]]&\"-xx\"","v":"BXRH-40E8000-J-xx"},9150,0.1,36.6,2500,3150,120,-2.385258E-14,2.3318505057999999E-10,-9.9249446937586004E-7,3.5308675524008599E-3,31.259636895079101,null,-2.1600000000000002E-8,4.4538420000000002E-4,2.57949744E-2,null,null,null,null,null,null,-9.4318000000000001E-6,-9.9051580000000003E-4,1.024579498,null,null,-2.4361365900000001E-2,37.209034146400001]
[null,null,null,null,null,{"$f":"MasterTable[[#This Row],[Product Family]]&\"-\"&MasterTable[[#This Row],[CCT/CRI]]&MasterTable[[#This Row],[Arrangement]]","v":"-"},null,null,{"$f":"INDEX(FF_stats31333[],MATCH(MasterTable[[#This Row],[Product Family]],FF_stats31333[Form Factor],0),3)","v":{"$error":"#N/A"}},null,null,{"$f":"INDEX(FF_stats31333[],MATCH(A251,FF_stats31333[Form Factor],0),2)","v":{"$error":"#N/A"}}]
[null,null,null,null,null,{"$f":"MasterTable[[#This Row],[Product Family]]&\"-\"&MasterTable[[#This Row],[CCT/CRI]]&MasterTable[[#This Row],[Arrangement]]","v":"-"},null,null,{"$f":"INDEX(FF_stats31333[],MATCH(MasterTable[[#This Row],[Product Family]],FF_stats31333[Form Factor],0),3)","v":{"$error":"#N/A"}},null,null,{"$f":"INDEX(FF_stats31333[],MATCH(A252,FF_stats31333[Form Factor],0),2)","v":{"$error":"#N/A"}}]
[null,null,null,null,null,{"$f":"MasterTable[[#This Row],[Product Family]]&\"-\"&MasterTable[[#This Row],[CCT/CRI]]&MasterTable[[#This Row],[Arrangement]]","v":"-"},null,null,{"$f":"INDEX(FF_stats31333[],MATCH(MasterTable[[#This Row],[Product Family]],FF_stats31333[Form Factor],0),3)","v":{"$error":"#N/A"}},null,null,{"$f":"INDEX(FF_stats31333[],MATCH(A253,FF_stats31333[Form Factor],0),2)","v":{"$error":"#N/A"}}]
[null,null,null,null,null,{"$f":"MasterTable[[#This Row],[Product Family]]&\"-\"&MasterTable[[#This Row],[CCT/CRI]]&MasterTable[[#This Row],[Arrangement]]","v":"-"},null,null,{"$f":"INDEX(FF_stats31333[],MATCH(MasterTable[[#This Row],[Product Family]],FF_stats31333[Form Factor],0),3)","v":{"$error":"#N/A"}},null,null,{"$f":"INDEX(FF_stats31333[],MATCH(A254,FF_stats31333[Form Factor],0),2)","v":{"$error":"#N/A"}}]